program: Orca
programVersion: 5.0.2
elementType: Cl S O O O O O O O N N N N N N N C C C C C C C C C C C C C C C H H H H H H H H H H H H H H H H H H
charge: 0
multiplicity: 1
keywords: wb97x-d3
keywords: def2-TZVPP
keywords: def2/J RIJCOSX
keywords: DEFGRID2
keywords: scfconv7
keywords: smallprint printgap noloewdin
keywords: NOSOSCF
formula: C15H18ClN7O7S
InChI: InChI=1/C15H18ClN7O7S/c1-7-6-29-21-12(30-7)10-11(16)20-23(2)13(10)31(25,26)22-15(24)19-14-17-8(27-3)5-9(18-14)28-4/h5,7,19,22H,6H2,1-4H3
49 atoms
Cl -4.187124 2.076981 1.06002
S  -1.099478 -1.706909 -1.522839
O  -1.814641 2.608649 -1.086371
O  0.817761 2.227379 -0.442341
O  -0.713895 -0.816452 -2.592211
O  -1.594186 -3.033307 -1.785718
O  -0.747377 -2.772121 1.230766
O  5.343533 -0.283806 2.85197
O  3.922858 0.421568 -1.513525
N  -3.433831 -1.409432 -0.054051
N  -4.19732 -0.500037 0.526878
N  0.245652 -1.774788 -0.558133
N  -0.120687 1.253448 -0.193847
N  1.348074 -1.967285 1.470858
N  3.343391 -1.129651 2.15813
N  2.628363 -0.772936 -0.061171
C  -2.302539 -0.865822 -0.544304
C  -2.334065 0.484908 -0.257005
C  -0.865496 3.61065 -1.450662
C  -1.323485 1.502847 -0.526494
C  0.293757 3.534563 -0.480226
C  -3.55297 0.637316 0.411413
C  -1.568421 4.947453 -1.432495
C  -3.892456 -2.786393 -0.073701
C  0.202552 -2.214574 0.737662
C  2.48532 -1.253689 1.161461
C  4.444173 -0.441416 1.895855
C  3.732502 -0.077431 -0.308367
C  4.706447 0.129134 0.656332
C  5.088941 -0.867878 4.119223
C  2.934581 0.205163 -2.512777
H  -0.505634 3.384976 -2.460809
H  -0.031721 3.848558 0.52072
H  1.109996 4.18541 -0.794943
H  -2.421737 4.94819 -2.109126
H  -0.886899 5.734907 -1.754731
H  -1.92715 5.191746 -0.432311
H  -4.774662 -2.822485 0.556003
H  -3.125564 -3.443484 0.322316
H  -4.150548 -3.094711 -1.083251
H  1.033185 -1.165725 -0.816644
H  1.303503 -2.292124 2.424853
H  5.606835 0.689091 0.456658
H  5.943371 -0.608507 4.738524
H  5.002855 -1.952983 4.054994
H  4.178402 -0.474028 4.571666
H  1.97914 0.652645 -2.242544
H  2.789128 -0.85665 -2.716092
H  3.316357 0.687968 -3.408349
totalener: -2350.77962807 hartree
nucrepener: 3845.81038583 hartree
electener: -6196.59001390 hartree
twoeener: 4682.35759053 hartree
kineticenergy: 2343.47581177 hartree
xcener: -177.140598246663 hartree
chargesum: 0.0000000
charge: -0.037458 0.860581 -0.266174 -0.208593 -0.456087 -0.436418 -0.397547 -0.264197 -0.262083 0.179513 -0.261819 -0.191738 -0.190759 -0.162472 -0.413554 -0.414111 -0.096658 -0.024517 0.107119 0.214443 -0.003918 0.098540 -0.247432 -0.170952 0.358166 0.369590 0.388144 0.414846 -0.303469 -0.123250 -0.121934 0.078190 0.088520 0.092069 0.103196 0.081191 0.084877 0.114527 0.137363 0.121524 0.200361 0.166544 0.125510 0.122049 0.106838 0.106731 0.100218 0.110063 0.124428
qa: -0.0375 0.8606 -0.2662 -0.2086 -0.4561 -0.4364 -0.3975 -0.2642 -0.2621 0.1795 -0.2618 -0.1917 -0.1908 -0.1625 -0.4136 -0.4141 -0.0967 -0.0245 0.1071 0.2144 -0.0039 0.0985 -0.2474 -0.1710 0.3582 0.3696 0.3881 0.4148 -0.3035 -0.1233 -0.1219 0.0782 0.0885 0.0921 0.1032 0.0812 0.0849 0.1145 0.1374 0.1215 0.2004 0.1665 0.1255 0.1220 0.1068 0.1067 0.1002 0.1101 0.1244
va: 1.2742 5.8997 2.1701 1.9815 2.0414 2.0695 2.1176 2.1496 2.1591 3.3430 2.8667 3.0973 2.8775 3.1705 2.9721 2.9669 4.0559 3.6635 3.9108 4.1678 3.9622 4.2389 3.9470 3.8628 4.3879 4.2469 4.0576 4.0059 3.9469 3.8798 3.8683 1.0023 1.0006 0.9994 1.0080 1.0082 1.0126 1.0076 1.0005 0.9935 1.0791 1.0365 1.0229 0.9944 0.9973 0.9974 1.0029 0.9960 0.9958
dispcorr: -0.030567749 hartree
energy: -2350.810195821347
dipole: 18.99958 -17.58734 1.41224 9.17995 -7.63548 1.54447 -1.50712 1.92911 0.42199
magnitude: 2.13492 au
magnitude: 5.42653 debye
