program: Orca
programVersion: 5.0.2
elementType: Cl S O O O O O O O N N N N N N N C C C C C C C C C C C C C C C H H H H H H H H H H H H H H H H H H
charge: 0
multiplicity: 1
keywords: wb97x-d3
keywords: def2-TZVPP
keywords: def2/J RIJCOSX
keywords: DEFGRID2
keywords: scfconv7
keywords: smallprint printgap noloewdin
keywords: NOSOSCF
formula: C15H18ClN7O7S
InChI: InChI=1/C15H18ClN7O7S/c1-7-6-29-21-12(30-7)10-11(16)20-23(2)13(10)31(25,26)22-15(24)19-14-17-8(27-3)5-9(18-14)28-4/h5,7,19,22H,6H2,1-4H3
49 atoms
Cl -4.066057 2.080901 1.068157
S  -1.108641 -1.774778 -1.567747
O  -1.646946 2.566085 -1.034055
O  0.962056 2.049615 -0.390283
O  -0.70298 -0.891888 -2.636406
O  -1.644018 -3.083787 -1.837885
O  -0.796983 -2.804581 1.20361
O  5.067936 0.100607 2.915545
O  3.869183 0.363304 -1.564679
N  -3.439695 -1.40903 -0.110029
N  -4.171591 -0.482036 0.483404
N  0.236357 -1.889056 -0.60756
N  -0.021313 1.113471 -0.170113
N  1.285354 -1.967766 1.457173
N  3.175631 -0.938837 2.183989
N  2.580627 -0.815053 -0.094237
C  -2.283138 -0.901795 -0.579668
C  -2.264212 0.443661 -0.265788
C  -0.652633 3.537318 -1.3600
C  -1.209738 1.424624 -0.502993
C  0.49709 3.379212 -0.387895
C  -3.481889 0.630845 0.396293
C  -1.296014 4.902483 -1.300296
C  -3.946062 -2.76888 -0.147857
C  0.161521 -2.26388 0.708683
C  2.391599 -1.202696 1.154748
C  4.243179 -0.198127 1.926365
C  3.644587 -0.058281 -0.335525
C  4.543023 0.290258 0.660632
C  4.763563 -0.382113 4.214154
C  2.943157 0.020342 -2.587226
H  -0.297318 3.32948 -2.375504
H  0.180206 3.675185 0.621329
H  1.342754 4.003105 -0.678429
H  -1.647797 5.129998 -0.293663
H  -2.145471 4.963694 -1.979015
H  -0.57867 5.668835 -1.594486
H  -3.21574 -3.452496 0.27259
H  -4.180891 -3.06802 -1.165493
H  -4.849231 -2.773803 0.45244
H  1.036348 -1.293836 -0.865824
H  1.209835 -2.227111 2.42914
H  5.412734 0.898652 0.466821
H  4.74355 -1.471785 4.247358
H  3.804045 -0.007115 4.571331
H  5.558742 -0.014769 4.857362
H  3.335152 0.466993 -3.497004
H  1.950206 0.422622 -2.388896
H  2.871505 -1.059536 -2.723762
totalener: -2350.77902809 hartree
nucrepener: 3875.52624813 hartree
electener: -6226.30527622 hartree
twoeener: 4712.06695068 hartree
kineticenergy: 2343.47905298 hartree
xcener: -177.141313627823 hartree
chargesum: 0.0000000
charge: -0.037310 0.863012 -0.266161 -0.205062 -0.457203 -0.437082 -0.392537 -0.264811 -0.262738 0.180496 -0.262086 -0.190410 -0.193938 -0.164626 -0.410488 -0.413393 -0.102820 -0.022605 0.108762 0.216030 -0.007495 0.098626 -0.247815 -0.170273 0.352537 0.370741 0.390559 0.418276 -0.303907 -0.123604 -0.118401 0.078338 0.088933 0.091140 0.084882 0.103448 0.081313 0.137313 0.121419 0.114508 0.196250 0.166454 0.123913 0.106709 0.106648 0.122080 0.124493 0.097125 0.110760
qa: -0.0373 0.8630 -0.2662 -0.2051 -0.4572 -0.4371 -0.3925 -0.2648 -0.2627 0.1805 -0.2621 -0.1904 -0.1939 -0.1646 -0.4105 -0.4134 -0.1028 -0.0226 0.1088 0.2160 -0.0075 0.0986 -0.2478 -0.1703 0.3525 0.3707 0.3906 0.4183 -0.3039 -0.1236 -0.1184 0.0783 0.0889 0.0911 0.0849 0.1034 0.0813 0.1373 0.1214 0.1145 0.1962 0.1665 0.1239 0.1067 0.1066 0.1221 0.1245 0.0971 0.1108
va: 1.2744 5.8960 2.1720 1.9796 2.0395 2.0689 2.1212 2.1489 2.1545 3.3419 2.8672 3.0920 2.8836 3.1711 2.9696 2.9641 4.0615 3.6601 3.9097 4.1698 3.9667 4.2396 3.9475 3.8614 4.3944 4.2465 4.0558 3.9922 3.9547 3.8803 3.8700 1.0019 1.0005 0.9999 1.0126 1.0080 1.0082 1.0001 0.9942 1.0077 1.0877 1.0364 1.0234 0.9973 0.9975 0.9942 0.9957 1.0019 0.9948
dispcorr: -0.031299475 hartree
energy: -2350.810327568464
dipole: 18.91694 -17.50489 1.41205 9.71115 -8.06751 1.64364 -1.00798 1.48174 0.47376
magnitude: 2.21808 au
magnitude: 5.63791 debye
