program: Orca
programVersion: 5.0.2
elementType: Cl S O O O O O O O N N N N N N N C C C C C C C C C C C C C C C H H H H H H H H H H H H H H H H H H
charge: 0
multiplicity: 1
keywords: wb97x-d3
keywords: def2-TZVPP
keywords: def2/J RIJCOSX
keywords: DEFGRID2
keywords: scfconv7
keywords: smallprint printgap noloewdin
keywords: NOSOSCF
formula: C15H18ClN7O7S
InChI: InChI=1/C15H18ClN7O7S/c1-7-6-29-21-12(30-7)10-11(16)20-23(2)13(10)31(25,26)22-15(24)19-14-17-8(27-3)5-9(18-14)28-4/h5,7,19,22H,6H2,1-4H3
49 atoms
Cl -3.821534 1.745118 -2.257756
S  -1.434921 -1.432809 1.579282
O  -1.867569 2.695527 0.199009
O  0.826127 2.142149 0.175435
O  -2.009964 -2.683643 2.000043
O  -1.233235 -0.34675 2.511645
O  -0.644392 -2.919831 -0.858635
O  5.452555 -0.230897 -2.023187
O  3.53864 0.72455 2.099883
N  -3.440255 -1.440398 -0.340628
N  -4.039844 -0.66994 -1.231716
N  0.064623 -1.684787 0.916447
N  -0.106511 1.170695 -0.093063
N  1.455483 -2.091492 -0.895433
N  3.451786 -1.165486 -1.456054
N  2.488106 -0.683548 0.641922
C  -2.401846 -0.8088 0.240395
C  -2.321644 0.453253 -0.315292
C  -0.946776 3.673659 0.683974
C  -1.336548 1.497333 -0.051373
C  0.368321 3.458759 -0.039301
C  -3.383219 0.46657 -1.224938
C  -0.837272 3.583895 2.194424
C  -3.939289 -2.78909 -0.145093
C  0.219155 -2.281081 -0.308108
C  2.50427 -1.270145 -0.542026
C  4.473319 -0.3809 -1.147783
C  3.512249 0.110213 0.932556
C  4.569654 0.3031 0.057914
C  5.356029 -0.909649 -3.265059
C  2.447405 0.543974 2.990985
H  -1.367268 4.640204 0.397536
H  1.146266 4.121321 0.34089
H  0.245483 3.651347 -1.11256
H  -0.444582 2.621289 2.521207
H  -1.813564 3.719772 2.657419
H  -0.177251 4.366931 2.569524
H  -3.136571 -3.507793 -0.272535
H  -4.700367 -2.944733 -0.9017
H  -4.376448 -2.902075 0.842992
H  0.811578 -1.03912 1.206497
H  1.543259 -2.511934 -1.808314
H  5.405602 0.942747 0.294792
H  5.320693 -1.991548 -3.134369
H  6.252998 -0.640574 -3.816473
H  4.475543 -0.599674 -3.828563
H  2.334655 -0.499454 3.28888
H  1.509872 0.895251 2.560132
H  2.684396 1.139565 3.868476
totalener: -2350.77760334 hartree
nucrepener: 3899.42201215 hartree
electener: -6250.19961549 hartree
twoeener: 4735.94317066 hartree
kineticenergy: 2343.47393851 hartree
xcener: -177.141564743303 hartree
chargesum: 0.0000000
charge: -0.035275 0.868460 -0.276250 -0.205438 -0.436525 -0.461073 -0.395182 -0.264387 -0.263089 0.179890 -0.260926 -0.190288 -0.173878 -0.164114 -0.410347 -0.416166 -0.116661 -0.026091 0.150781 0.190945 -0.021629 0.097419 -0.269260 -0.170254 0.354900 0.372418 0.390142 0.419114 -0.303390 -0.124346 -0.104272 0.085659 0.086610 0.102633 0.097221 0.103008 0.078630 0.136683 0.114202 0.121593 0.196346 0.166759 0.124599 0.106470 0.122269 0.108016 0.116122 0.072175 0.125778
qa: -0.0353 0.8685 -0.2762 -0.2054 -0.4365 -0.4611 -0.3952 -0.2644 -0.2631 0.1799 -0.2609 -0.1903 -0.1739 -0.1641 -0.4103 -0.4162 -0.1167 -0.0261 0.1508 0.1909 -0.0216 0.0974 -0.2693 -0.1703 0.3549 0.3724 0.3901 0.4191 -0.3034 -0.1243 -0.1043 0.0857 0.0866 0.1026 0.0972 0.1030 0.0786 0.1367 0.1142 0.1216 0.1963 0.1668 0.1246 0.1065 0.1223 0.1080 0.1161 0.0722 0.1258
va: 1.2769 5.8859 2.1553 1.9766 2.0708 2.0327 2.1177 2.1494 2.1553 3.3425 2.8659 3.0960 2.8882 3.1733 2.9706 2.9621 4.0977 3.6900 3.9036 4.1774 3.9791 4.2394 3.9685 3.8612 4.3892 4.2447 4.0572 3.9923 3.9544 3.8797 3.8757 0.9961 0.9957 0.9995 1.0023 1.0116 1.0097 1.0007 1.0078 0.9938 1.0836 1.0363 1.0231 0.9975 0.9942 0.9972 0.9961 0.9985 0.9965
dispcorr: -0.032345064 hartree
energy: -2350.809948404221
dipole: 20.06955 -18.51341 1.55614 6.81048 -5.39768 1.41280 8.08278 -8.37392 -0.29113
magnitude: 2.12187 au
magnitude: 5.39337 debye
