program: Orca
programVersion: 5.0.2
elementType: Cl S O O O O O O O N N N N N N N C C C C C C C C C C C C C C C H H H H H H H H H H H H H H H H H H
charge: 0
multiplicity: 1
keywords: wb97x-d3
keywords: def2-TZVPP
keywords: def2/J RIJCOSX
keywords: DEFGRID2
keywords: scfconv7
keywords: smallprint printgap noloewdin
keywords: NOSOSCF
formula: C15H18ClN7O7S
InChI: InChI=1/C15H18ClN7O7S/c1-7-6-29-21-12(30-7)10-11(16)20-23(2)13(10)31(25,26)22-15(24)19-14-17-8(27-3)5-9(18-14)28-4/h5,7,19,22H,6H2,1-4H3
49 atoms
Cl -3.952357 1.73288 -2.193576
S  -1.330853 -1.417469 1.528471
O  -2.088688 2.767044 0.148024
O  0.617334 2.402759 0.431017
O  -1.848249 -2.703668 1.917055
O  -1.146038 -0.361061 2.494634
O  -0.5372 -2.90607 -0.901943
O  3.773567 0.650288 2.009551
O  5.783953 -0.717546 -1.944338
N  -3.353965 -1.470036 -0.366955
N  -4.007092 -0.71085 -1.229759
N  0.160732 -1.595458 0.820639
N  -0.210756 1.363429 0.088529
N  1.581293 -2.136671 -0.935925
N  2.654635 -0.726184 0.570724
N  3.67826 -1.431419 -1.436064
C  -2.352153 -0.793772 0.228957
C  -2.356268 0.489441 -0.286337
C  -1.243209 3.90875 0.26854
C  -1.459233 1.597777 0.009914
C  -0.026626 3.486263 1.064718
C  -3.423879 0.463639 -1.191278
C  -2.037121 5.009964 0.929512
C  -3.782151 -2.848055 -0.206402
C  0.329527 -2.260018 -0.364411
C  2.680431 -1.391217 -0.570991
C  3.739641 -0.022169 0.875665
C  4.75176 -0.723251 -1.119142
C  4.851827 0.021041 0.049825
C  2.648568 0.592458 2.875216
C  5.702805 -1.483881 -3.135015
H  -0.929611 4.218702 -0.735223
H  -0.327917 3.216486 2.086071
H  0.708684 4.289666 1.121263
H  -2.939194 5.233408 0.361664
H  -1.441885 5.921647 0.981666
H  -2.331642 4.734422 1.942475
H  -4.213712 -3.007729 0.777757
H  -2.944395 -3.521445 -0.350769
H  -4.534326 -3.021717 -0.968065
H  0.896406 -0.938881 1.104377
H  1.67534 -2.615368 -1.819063
H  5.733385 0.591154 0.298825
H  2.910588 1.203646 3.734742
H  2.44696 -0.425961 3.210412
H  1.754286 0.997883 2.402978
H  4.890392 -1.146801 -3.779345
H  5.562776 -2.544775 -2.925344
H  6.652625 -1.337747 -3.642537
totalener: -2350.78021536 hartree
nucrepener: 3828.31004936 hartree
electener: -6179.09026472 hartree
twoeener: 4664.86472156 hartree
kineticenergy: 2343.46983273 hartree
xcener: -177.139748068231 hartree
chargesum: 0.0000000
charge: -0.035476 0.862462 -0.276712 -0.215609 -0.436353 -0.452719 -0.404735 -0.262100 -0.263620 0.182507 -0.262562 -0.190438 -0.180453 -0.163287 -0.421381 -0.414668 -0.110917 -0.058837 0.111846 0.253240 -0.011744 0.098772 -0.243607 -0.172293 0.362939 0.371816 0.415043 0.388354 -0.302959 -0.124733 -0.123535 0.074493 0.093733 0.098514 0.103193 0.078743 0.086364 0.121688 0.138876 0.114105 0.207018 0.167309 0.126097 0.126138 0.115760 0.093212 0.107900 0.106451 0.122165
qa: -0.0355 0.8625 -0.2767 -0.2156 -0.4364 -0.4527 -0.4047 -0.2621 -0.2636 0.1825 -0.2626 -0.1904 -0.1805 -0.1633 -0.4214 -0.4147 -0.1109 -0.0588 0.1118 0.2532 -0.0117 0.0988 -0.2436 -0.1723 0.3629 0.3718 0.4150 0.3884 -0.3030 -0.1247 -0.1235 0.0745 0.0937 0.0985 0.1032 0.0787 0.0864 0.1217 0.1389 0.1141 0.2070 0.1673 0.1261 0.1261 0.1158 0.0932 0.1079 0.1065 0.1222
va: 1.2751 5.8986 2.1651 1.9804 2.0704 2.0452 2.1086 2.1594 2.1503 3.3417 2.8636 3.1072 2.9224 3.1709 2.9632 2.9724 4.0645 3.7163 3.9342 4.1127 3.9380 4.2349 3.9363 3.8610 4.3789 4.2423 4.0086 4.0577 3.9445 3.8751 3.8796 1.0070 0.9973 0.9955 1.0090 1.0081 1.0112 0.9936 1.0004 1.0078 1.0608 1.0365 1.0228 0.9954 0.9964 0.9955 0.9969 0.9974 0.9943
dispcorr: -0.030103783 hartree
energy: -2350.810319141829
dipole: 17.90718 -16.47264 1.43454 9.01897 -7.64518 1.37378 6.52099 -6.74605 -0.22506
magnitude: 1.99896 au
magnitude: 5.08095 debye
