program: Orca
programVersion: 5.0.2
elementType: Cl S O O O O O O O N N N N N N N C C C C C C C C C C C C C C C H H H H H H H H H H H H H H H H H H
charge: 0
multiplicity: 1
keywords: wb97x-d3
keywords: def2-TZVPP
keywords: def2/J RIJCOSX
keywords: DEFGRID2
keywords: scfconv7
keywords: smallprint printgap noloewdin
keywords: NOSOSCF
formula: C15H18ClN7O7S
InChI: InChI=1/C15H18ClN7O7S/c1-7-6-29-21-12(30-7)10-11(16)20-23(2)13(10)31(25,26)22-15(24)19-14-17-8(27-3)5-9(18-14)28-4/h5,7,19,22H,6H2,1-4H3
49 atoms
Cl -3.776363 1.666934 -2.38755
S  -1.468131 -1.359047 1.615186
O  -1.854235 2.703809 0.065244
O  0.838118 2.138694 0.103147
O  -2.05897 -2.587935 2.076159
O  -1.278567 -0.233387 2.501923
O  -0.631925 -2.983898 -0.714265
O  5.460623 -0.332839 -1.958197
O  3.53163 0.799704 2.111492
N  -3.441912 -1.439366 -0.336612
N  -4.022932 -0.702978 -1.267962
N  0.044224 -1.644101 0.995766
N  -0.095207 1.16273 -0.144805
N  1.469131 -2.158983 -0.761292
N  3.462688 -1.250063 -1.354224
N  2.48679 -0.674566 0.714681
C  -2.40712 -0.790703 0.232332
C  -2.310039 0.446166 -0.374496
C  -0.936161 3.690128 0.538819
C  -1.324298 1.49545 -0.13489
C  0.38801 3.449176 -0.159218
C  -3.359051 0.428967 -1.298453
C  -0.850646 3.639052 2.052883
C  -3.954765 -2.775199 -0.093149
C  0.222338 -2.313871 -0.186906
C  2.511542 -1.316058 -0.440388
C  4.480927 -0.449533 -1.078294
C  3.509856 0.131729 0.973754
C  4.572066 0.285531 0.097152
C  5.365111 -1.059969 -3.172352
C  2.441982 0.655334 3.010438
H  -1.347062 4.650821 0.220716
H  1.16338 4.121176 0.209446
H  0.279468 3.607558 -1.239609
H  -1.828806 3.816258 2.49755
H  -0.172803 4.412197 2.416636
H  -0.492021 2.674644 2.411956
H  -3.157257 -3.505487 -0.183359
H  -4.709563 -2.953587 -0.851252
H  -4.403393 -2.845192 0.893844
H  0.784886 -0.984506 1.266724
H  1.570028 -2.626269 -1.649727
H  5.406527 0.935601 0.3097
H  5.326661 -2.135845 -2.999504
H  6.263634 -0.81495 -3.732352
H  4.486322 -0.77013 -3.749208
H  2.327951 -0.375631 3.348399
H  1.504272 0.991646 2.567744
H  2.681537 1.283979 3.863893
totalener: -2350.77764619 hartree
nucrepener: 3898.05725958 hartree
electener: -6248.83490577 hartree
twoeener: 4734.57388670 hartree
kineticenergy: 2343.47221875 hartree
xcener: -177.141027290701 hartree
chargesum: 0.0000000
charge: -0.035016 0.869239 -0.276589 -0.204586 -0.436089 -0.461140 -0.394822 -0.264422 -0.263113 0.178188 -0.260781 -0.189899 -0.173397 -0.165490 -0.410471 -0.418146 -0.114109 -0.027053 0.151444 0.187390 -0.021469 0.098004 -0.269171 -0.170408 0.355339 0.372674 0.390380 0.420396 -0.303545 -0.123998 -0.105298 0.085745 0.086467 0.102519 0.103540 0.077875 0.096913 0.137347 0.114371 0.121256 0.197127 0.166856 0.124507 0.106327 0.122101 0.107996 0.115788 0.073172 0.126052
qa: -0.0350 0.8692 -0.2766 -0.2046 -0.4361 -0.4611 -0.3948 -0.2644 -0.2631 0.1782 -0.2608 -0.1899 -0.1734 -0.1655 -0.4105 -0.4181 -0.1141 -0.0271 0.1514 0.1874 -0.0215 0.0980 -0.2692 -0.1704 0.3553 0.3727 0.3904 0.4204 -0.3035 -0.1240 -0.1053 0.0857 0.0865 0.1025 0.1035 0.0779 0.0969 0.1373 0.1144 0.1213 0.1971 0.1669 0.1245 0.1063 0.1221 0.1080 0.1158 0.0732 0.1261
va: 1.2772 5.8858 2.1542 1.9772 2.0718 2.0325 2.1182 2.1495 2.1544 3.3430 2.8656 3.0965 2.8890 3.1735 2.9699 2.9594 4.0981 3.6928 3.9019 4.1790 3.9784 4.2387 3.9687 3.8609 4.3908 4.2438 4.0565 3.9914 3.9557 3.8797 3.8757 0.9963 0.9959 0.9995 1.0114 1.0097 1.0033 1.0002 1.0078 0.9940 1.0805 1.0363 1.0232 0.9975 0.9943 0.9971 0.9963 0.9987 0.9963
dispcorr: -0.032290564 hartree
energy: -2350.809936752686
dipole: 19.95353 -18.39123 1.56230 7.00066 -5.61084 1.38982 8.16121 -8.47374 -0.31254
magnitude: 2.11425 au
magnitude: 5.37400 debye
