program: Orca
programVersion: 5.0.2
elementType: Cl S O O O O O O O N N N N N N N C C C C C C C C C C C C C C C H H H H H H H H H H H H H H H H H H
charge: 0
multiplicity: 1
keywords: wb97x-d3
keywords: def2-TZVPP
keywords: def2/J RIJCOSX
keywords: DEFGRID2
keywords: scfconv7
keywords: smallprint printgap noloewdin
keywords: NOSOSCF
formula: C15H18ClN7O7S
InChI: InChI=1/C15H18ClN7O7S/c1-7-6-29-21-12(30-7)10-11(16)20-23(2)13(10)31(25,26)22-15(24)19-14-17-8(27-3)5-9(18-14)28-4/h5,7,19,22H,6H2,1-4H3
49 atoms
Cl -3.48711 1.265967 2.765926
S  -1.59745 -1.146218 -1.851107
O  -1.731457 2.662607 0.531307
O  0.900786 2.106836 -0.03963
O  -1.461945 0.07876 -2.60347
O  -2.262343 -2.292789 -2.412017
O  -0.582828 -3.125842 0.119736
O  3.271083 1.226227 -2.272528
O  5.440017 -0.409947 1.491688
N  -3.381621 -1.485157 0.24242
N  -3.866561 -0.893752 1.320602
N  -0.04316 -1.53102 -1.412482
N  -0.031863 1.109546 0.088693
N  1.508671 -2.276889 0.14717
N  2.392773 -0.535448 -1.115642
N  3.478544 -1.35679 0.810499
C  -2.394997 -0.75988 -0.320314
C  -2.227191 0.376364 0.450546
C  -0.744302 3.67721 0.713172
C  -1.238805 1.439271 0.326594
C  0.369218 3.392751 -0.27673
C  -3.188102 0.220305 1.456847
C  -0.283164 3.725084 2.157693
C  -3.930097 -2.776071 -0.134534
C  0.224675 -2.366845 -0.358019
C  2.497212 -1.340058 -0.073501
C  3.340151 0.383588 -1.259939
C  4.429259 -0.449942 0.639937
C  4.41734 0.477756 -0.393632
C  2.185059 1.115747 -3.180223
C  5.476714 -1.360403 2.542972
H  -1.239625 4.614043 0.450371
H  1.198009 4.092309 -0.164494
H  -0.01318 3.468974 -1.30247
H  -1.134947 3.841268 2.826293
H  0.380554 4.576998 2.308571
H  0.258088 2.825004 2.4482
H  -4.482433 -2.707227 -1.067231
H  -4.600522 -3.064583 0.667533
H  -3.134972 -3.507168 -0.2344
H  0.67691 -0.828886 -1.629107
H  1.671372 -2.870801 0.946477
H  5.193496 1.21734 -0.515093
H  1.22407 1.279633 -2.692582
H  2.169293 0.144303 -3.676592
H  2.345321 1.89147 -3.924244
H  5.511838 -2.382523 2.164451
H  4.616563 -1.265161 3.206181
H  6.387189 -1.149054 3.097583
totalener: -2350.77735721 hartree
nucrepener: 3909.53439493 hartree
electener: -6260.31175214 hartree
twoeener: 4746.02171840 hartree
kineticenergy: 2343.46953728 hartree
xcener: -177.141210459634 hartree
chargesum: -0.0000000
charge: -0.035941 0.867422 -0.282980 -0.209837 -0.455262 -0.435582 -0.394044 -0.264032 -0.264900 0.184465 -0.264578 -0.191203 -0.185678 -0.168924 -0.416782 -0.408361 -0.121302 -0.059196 0.172511 0.236541 -0.034662 0.091699 -0.287300 -0.170458 0.353730 0.371221 0.421591 0.389029 -0.300078 -0.119975 -0.123603 0.086856 0.094858 0.106171 0.098293 0.084819 0.106054 0.121680 0.114305 0.137903 0.198292 0.166832 0.122649 0.086797 0.118551 0.127261 0.106064 0.107430 0.121650
qa: -0.0359 0.8674 -0.2830 -0.2098 -0.4553 -0.4356 -0.3940 -0.2640 -0.2649 0.1845 -0.2646 -0.1912 -0.1857 -0.1689 -0.4168 -0.4084 -0.1213 -0.0592 0.1725 0.2365 -0.0347 0.0917 -0.2873 -0.1705 0.3537 0.3712 0.4216 0.3890 -0.3001 -0.1200 -0.1236 0.0869 0.0949 0.1062 0.0983 0.0848 0.1061 0.1217 0.1143 0.1379 0.1983 0.1668 0.1226 0.0868 0.1186 0.1273 0.1061 0.1074 0.1217
va: 1.2756 5.8924 2.1590 1.9675 2.0414 2.0709 2.1175 2.1445 2.1484 3.3383 2.8671 3.0933 2.9140 3.1701 2.9575 2.9694 4.0530 3.7053 3.9214 4.1644 3.9492 4.2459 3.9552 3.8597 4.3903 4.2444 3.9827 4.0580 3.9700 3.8718 3.8811 0.9924 0.9956 0.9949 1.0139 1.0106 1.0070 0.9937 1.0078 1.0011 1.0820 1.0364 1.0235 0.9953 0.9961 0.9948 0.9975 0.9971 0.9944
dispcorr: -0.032533266 hartree
energy: -2350.809890475162
dipole: 20.50479 -18.86923 1.63556 8.04925 -6.67552 1.37374 -0.58918 1.23539 0.64622
magnitude: 2.23154 au
magnitude: 5.67214 debye
