program: Orca
programVersion: 5.0.2
elementType: Cl S O O O O O O O N N N N N N N C C C C C C C C C C C C C C C H H H H H H H H H H H H H H H H H H
charge: 0
multiplicity: 1
keywords: wb97x-d3
keywords: def2-TZVPP
keywords: def2/J RIJCOSX
keywords: DEFGRID2
keywords: scfconv7
keywords: smallprint printgap noloewdin
keywords: NOSOSCF
formula: C15H18ClN7O7S
InChI: InChI=1/C15H18ClN7O7S/c1-7-6-29-21-12(30-7)10-11(16)20-23(2)13(10)31(25,26)22-15(24)19-14-17-8(27-3)5-9(18-14)28-4/h5,7,19,22H,6H2,1-4H3
49 atoms
Cl -4.106555 2.107152 0.903697
S  -1.079979 -1.834536 -1.525936
O  -1.689698 2.544831 -1.166637
O  0.94365 2.047623 -0.552828
O  -0.655734 -0.999421 -2.625667
O  -1.605716 -3.156805 -1.746519
O  -0.813825 -2.767668 1.284459
O  4.936342 0.322294 3.047988
O  3.879806 0.370347 -1.474701
N  -3.433625 -1.422525 -0.119582
N  -4.181467 -0.477437 0.424419
N  0.246612 -1.898653 -0.533474
N  -0.041049 1.131985 -0.276238
N  1.251315 -1.896307 1.557008
N  3.094489 -0.795012 2.30057
N  2.573609 -0.782011 0.000792
C  -2.277384 -0.924698 -0.599594
C  -2.276142 0.434195 -0.34692
C  -0.74437 3.612627 -1.219633
C  -1.235081 1.418495 -0.613925
C  0.603816 2.996485 -1.540742
C  -3.502492 0.637423 0.294834
C  -0.761869 4.410604 0.070348
C  -3.931805 -2.785986 -0.108426
C  0.148809 -2.231541 0.792827
C  2.351072 -1.120173 1.258453
C  4.15057 -0.03662 2.04735
C  3.624063 -0.005266 -0.235807
C  4.478068 0.410288 0.772953
C  4.609418 -0.123683 4.354147
C  3.034774 -0.093921 -2.517383
H  -1.066252 4.244225 -2.050534
H  1.399056 3.742561 -1.536417
H  0.574051 2.526725 -2.532423
H  -0.400918 3.829797 0.918691
H  -1.7712 4.752529 0.294418
H  -0.12441 5.289822 -0.02873
H  -4.83015 -2.775967 0.49888
H  -3.194721 -3.451441 0.328048
H  -4.173377 -3.119113 -1.114062
H  1.046858 -1.307564 -0.797627
H  1.152527 -2.120942 2.53561
H  5.337835 1.033681 0.582439
H  4.619062 -1.211724 4.425306
H  3.630277 0.235633 4.67181
H  5.375812 0.288315 5.005272
H  3.044111 -1.182345 -2.591601
H  3.441613 0.326954 -3.433028
H  2.005692 0.242965 -2.393428
totalener: -2350.77791020 hartree
nucrepener: 3894.09571964 hartree
electener: -6244.87362984 hartree
twoeener: 4730.56788137 hartree
kineticenergy: 2343.47196674 hartree
xcener: -177.141242570084 hartree
chargesum: -0.0000000
charge: -0.036340 0.866318 -0.278795 -0.211946 -0.457708 -0.435910 -0.393032 -0.264423 -0.264031 0.183466 -0.263914 -0.193345 -0.183181 -0.165843 -0.410196 -0.413113 -0.116647 -0.052937 0.171242 0.223296 -0.037023 0.096036 -0.286553 -0.170641 0.354064 0.370108 0.389883 0.419588 -0.302028 -0.124083 -0.117100 0.085701 0.096908 0.105342 0.106219 0.098968 0.083781 0.114459 0.137168 0.121876 0.198633 0.166821 0.123975 0.106631 0.107382 0.122229 0.120239 0.127340 0.081119
qa: -0.0363 0.8663 -0.2788 -0.2119 -0.4577 -0.4359 -0.3930 -0.2644 -0.2640 0.1835 -0.2639 -0.1933 -0.1832 -0.1658 -0.4102 -0.4131 -0.1166 -0.0529 0.1712 0.2233 -0.0370 0.0960 -0.2866 -0.1706 0.3541 0.3701 0.3899 0.4196 -0.3020 -0.1241 -0.1171 0.0857 0.0969 0.1053 0.1062 0.0990 0.0838 0.1145 0.1372 0.1219 0.1986 0.1668 0.1240 0.1066 0.1074 0.1222 0.1202 0.1273 0.0811
va: 1.2754 5.8929 2.1605 1.9649 2.0379 2.0704 2.1203 2.1498 2.1476 3.3395 2.8668 3.0945 2.9088 3.1715 2.9709 2.9629 4.0582 3.6916 3.9199 4.1785 3.9484 4.2412 3.9527 3.8616 4.3917 4.2466 4.0585 3.9870 3.9637 3.8801 3.8740 0.9931 0.9954 0.9935 1.0074 1.0133 1.0104 1.0077 1.0008 0.9936 1.0825 1.0362 1.0232 0.9972 0.9974 0.9942 0.9966 0.9951 0.9933
dispcorr: -0.032245367 hartree
energy: -2350.810155571275
dipole: 20.41129 -18.92522 1.48607 7.99537 -6.49582 1.49955 1.08066 -0.72065 0.36001
magnitude: 2.14165 au
magnitude: 5.44365 debye
