program: Orca
programVersion: 5.0.2
elementType: O O O N N N C C C C C C C C C C C C C C C H H H H H H H H H H H H H H H H H H H
charge: 0
multiplicity: 1
keywords: wb97x-d3
keywords: def2-TZVPP
keywords: def2/J RIJCOSX
keywords: DEFGRID2
keywords: scfconv7
keywords: smallprint printgap noloewdin
keywords: NOSOSCF
formula: C15H19N3O3
InChI: InChI=1/C15H19N3O3/c1-5-9-6-10(13(19)20)11(16-7-9)12-17-14(21)15(4,18-12)8(2)3/h6-8,17,19H,5H2,1-4H3
40 atoms
O  3.336609 2.556865 -0.106009
O  -0.191125 -2.265618 1.256867
O  -0.874869 -2.834122 -0.796878
N  1.303833 -0.318326 -0.498184
N  1.150105 1.848315 0.044438
N  -1.599953 1.642278 0.070465
C  2.654548 0.221839 -0.530759
C  3.548794 -0.47134 0.525637
C  2.483526 1.695025 -0.174426
C  3.238292 0.119137 -1.937462
C  3.039947 -0.263413 1.949295
C  3.719299 -1.958547 0.241204
C  0.529414 0.628539 -0.147659
C  -0.919753 0.502997 0.027942
C  -1.541148 -0.741053 0.106134
C  -3.648101 0.411367 0.21283
C  -2.925823 -0.773294 0.177537
C  -2.918048 1.594955 0.167749
C  -5.145016 0.422925 0.250788
C  -0.811765 -2.043862 0.111447
C  -5.73874 0.382137 -1.155208
H  4.529126 0.009504 0.44296
H  3.240442 -0.912995 -2.282004
H  2.656911 0.706545 -2.648949
H  4.264346 0.486575 -1.950528
H  2.054451 -0.706478 2.09865
H  3.719096 -0.740123 2.657042
H  2.983003 0.789365 2.230581
H  2.762117 -2.481518 0.258703
H  4.352785 -2.409965 1.005956
H  4.192544 -2.150465 -0.721305
H  0.680026 2.706119 0.29722
H  -3.44506 -1.723221 0.230262
H  -3.430468 2.549639 0.212269
H  -5.501723 -0.433937 0.824735
H  -5.490192 1.319839 0.768272
H  -5.423421 -0.51392 -1.691022
H  -5.427553 1.248616 -1.739836
H  -6.827924 0.380527 -1.112734
H  0.270623 -3.119652 1.232521
elementType: O N C H
totalener: -973.13927751 hartree
nucrepener: 1735.48743953 hartree
electener: -2708.62671704 hartree
oneelecener: -4771.39337223 hartree
twoeener: 2062.76665519 hartree
cpcmener: -0.04507914 hartree
kineticenergy: 968.95803198 hartree
xcener: -93.277956326454 hartree
chargesum: -0.0000000
charge: -0.491839 -0.289748 -0.447122 -0.405461 -0.086947 -0.401326 0.384286 0.041369 0.196163 -0.329484 -0.313420 -0.309418 0.242516 0.170778 -0.084249 -0.039826 -0.050292 0.018379 -0.079170 0.415173 -0.260689 0.050202 0.107302 0.116233 0.106194 0.086286 0.103399 0.100587 0.081108 0.097576 0.098034 0.181775 0.146203 0.130315 0.081937 0.083154 0.089615 0.088705 0.096501 0.275202
qa: -0.4918 -0.2897 -0.4471 -0.4055 -0.0869 -0.4013 0.3843 0.0414 0.1962 -0.3295 -0.3134 -0.3094 0.2425 0.1708 -0.0842 -0.0398 -0.0503 0.0184 -0.0792 0.4152 -0.2607 0.0502 0.1073 0.1162 0.1062 0.0863 0.1034 0.1006 0.0811 0.0976 0.0980 0.1818 0.1462 0.1303 0.0819 0.0832 0.0896 0.0887 0.0965 0.2752
va: 2.0302 2.1948 2.0423 3.0277 3.2350 3.0376 3.5865 3.8189 4.2670 3.9721 3.9391 3.9558 4.2539 3.7547 3.8550 3.7687 3.9523 4.0666 3.8641 4.3067 3.9168 1.0300 1.0016 0.9997 1.0082 1.0114 1.0040 1.0075 1.0119 1.0044 0.9997 1.0261 1.0052 1.0048 1.0056 1.0056 1.0019 1.0015 1.0042 0.9772
dispcorr: -0.020521153 hartree
energy: -973.159798662516
dipole: 0.48517 -3.00329 -2.51812 -4.42501 3.88251 -0.54250 0.21360 0.97169 1.18529
magnitude: 2.83551 au
magnitude: 7.20730 debye
