program: Orca
programVersion: 5.0.2
elementType: O O O N N N C C C C C C C C C C C C C C C H H H H H H H H H H H H H H H H H H H
charge: 0
multiplicity: 1
keywords: wb97x-d3
keywords: def2-TZVPP
keywords: def2/J RIJCOSX
keywords: DEFGRID2
keywords: scfconv7
keywords: smallprint printgap noloewdin
keywords: NOSOSCF
formula: C15H19N3O3
InChI: InChI=1/C15H19N3O3/c1-5-9-6-10(13(19)20)11(16-7-9)12-17-14(21)15(4,18-12)8(2)3/h6-8,17,19H,5H2,1-4H3
40 atoms
O  3.325205 2.561816 -0.114734
O  -0.233432 -2.30004 1.239016
O  -0.887235 -2.827546 -0.834159
N  1.3094 -0.333505 -0.444326
N  1.140174 1.84634 0.032385
N  -1.597533 1.636502 0.08075
C  2.655688 0.216393 -0.505578
C  3.5766 -0.457342 0.538268
C  2.478584 1.69802 -0.174245
C  3.202353 0.095475 -1.927092
C  3.072087 -0.268737 1.965802
C  3.780388 -1.938363 0.244643
C  0.528291 0.619329 -0.132989
C  -0.923684 0.494931 0.032299
C  -1.551875 -0.746669 0.096356
C  -3.653059 0.419831 0.207842
C  -2.936856 -0.769056 0.165927
C  -2.915308 1.599795 0.172759
C  -5.150642 0.439096 0.244373
C  -0.82966 -2.054856 0.086243
C  -5.750081 0.392521 -1.158683
H  4.544418 0.048034 0.451659
H  3.184212 -0.9405 -2.26094
H  2.605908 0.67871 -2.6301
H  4.230541 0.455647 -1.974444
H  2.111821 -0.760924 2.126205
H  3.780581 -0.707034 2.670398
H  2.963958 0.781299 2.243674
H  2.833601 -2.479604 0.245574
H  4.41539 -2.385147 1.010989
H  4.267998 -2.113025 -0.714305
H  0.660787 2.706487 0.258658
H  -3.461601 -1.716761 0.207058
H  -3.421865 2.55814 0.221597
H  -5.512245 -0.411333 0.825548
H  -5.491548 1.340598 0.757474
H  -5.441244 -0.506873 -1.693083
H  -5.440661 1.254891 -1.750744
H  -6.839516 0.394273 -1.111634
H  0.219223 -3.159543 1.210123
elementType: O N C H
totalener: -973.14239951 hartree
nucrepener: 1733.26653058 hartree
electener: -2706.40893009 hartree
oneelecener: -4766.94737156 hartree
twoeener: 2060.53844147 hartree
cpcmener: -0.03695371 hartree
kineticenergy: 968.96396024 hartree
xcener: -93.275944619906 hartree
chargesum: -0.0000000
charge: -0.454576 -0.283728 -0.417883 -0.399583 -0.090226 -0.399664 0.375899 0.046662 0.172901 -0.330952 -0.309669 -0.309437 0.251944 0.163840 -0.078496 -0.038560 -0.050307 0.015406 -0.083770 0.391255 -0.256957 0.049225 0.106613 0.114733 0.106923 0.082848 0.102165 0.099371 0.081485 0.095767 0.096950 0.177986 0.142804 0.127384 0.081252 0.081885 0.089084 0.088122 0.095761 0.265544
qa: -0.4546 -0.2837 -0.4179 -0.3996 -0.0902 -0.3997 0.3759 0.0467 0.1729 -0.3310 -0.3097 -0.3094 0.2519 0.1638 -0.0785 -0.0386 -0.0503 0.0154 -0.0838 0.3913 -0.2570 0.0492 0.1066 0.1147 0.1069 0.0828 0.1022 0.0994 0.0815 0.0958 0.0969 0.1780 0.1428 0.1274 0.0813 0.0819 0.0891 0.0881 0.0958 0.2655
va: 2.0778 2.1955 2.0790 3.0285 3.2214 3.0371 3.5865 3.8137 4.2950 3.9760 3.9418 3.9552 4.2511 3.7644 3.8501 3.7613 3.9554 4.0726 3.8691 4.3406 3.9162 1.0310 1.0015 1.0001 1.0076 1.0122 1.0042 1.0075 1.0122 1.0045 1.0000 1.0293 1.0058 1.0054 1.0053 1.0057 1.0024 1.0019 1.0044 0.9860
dispcorr: -0.020374410 hartree
energy: -973.162773917433
dipole: 0.58264 -2.99944 -2.41680 -4.36379 3.84890 -0.51490 0.19135 0.86896 1.06031
magnitude: 2.68893 au
magnitude: 6.83470 debye
