program: Orca
programVersion: 5.0.2
elementType: O O O N N N C C C C C C C C C C C C C C C H H H H H H H H H H H H H H H H H H H
charge: 0
multiplicity: 1
keywords: wb97x-d3
keywords: def2-TZVPP
keywords: def2/J RIJCOSX
keywords: DEFGRID2
keywords: scfconv7
keywords: smallprint printgap noloewdin
keywords: NOSOSCF
formula: C15H19N3O3
InChI: InChI=1/C15H19N3O3/c1-5-9-6-10(13(19)20)11(16-7-9)12-17-14(21)15(4,18-12)8(2)3/h6-8,17,19H,5H2,1-4H3
40 atoms
O  3.415078 2.493296 -0.208574
O  -0.729222 -2.428883 -1.353151
O  -0.610574 -2.580173 0.877347
N  1.331244 -0.369859 -0.310808
N  1.201774 1.858152 -0.153213
N  -1.532857 1.735372 -0.067593
C  2.696029 0.13313 -0.346148
C  3.523696 -0.423869 0.834937
C  2.546666 1.649497 -0.223617
C  3.327675 -0.184007 -1.701237
C  2.946672 -0.015483 2.186735
C  3.67015 -1.939077 0.764667
C  0.561808 0.636026 -0.204034
C  -0.899697 0.568598 -0.127551
C  -1.575185 -0.644874 -0.109941
C  -3.63449 0.58968 0.035058
C  -2.961919 -0.621495 -0.023611
C  -2.848653 1.743388 0.008013
C  -5.129405 0.712993 0.125869
C  -0.887839 -1.973925 -0.124108
C  -5.896484 -0.596773 0.151428
H  4.519033 0.023406 0.739768
H  3.304916 -1.254473 -1.897588
H  2.790553 0.310715 -2.511807
H  4.36544 0.149821 -1.728143
H  2.901656 1.067165 2.31906
H  1.94305 -0.417873 2.337282
H  3.573295 -0.402995 2.99154
H  4.166781 -2.272644 -0.146617
H  2.70113 -2.437574 0.823676
H  4.273001 -2.292746 1.602803
H  0.736956 2.752241 -0.077329
H  -3.507978 -1.55647 -0.003206
H  -3.321222 2.719493 0.052778
H  -5.37011 1.294312 1.020426
H  -5.473754 1.320748 -0.715823
H  -6.966018 -0.398723 0.219037
H  -5.625206 -1.213253 1.009767
H  -5.731257 -1.185063 -0.752413
H  -0.302282 -3.301165 -1.339588
elementType: O N C H
totalener: -973.14166400 hartree
nucrepener: 1730.88408827 hartree
electener: -2704.02575227 hartree
oneelecener: -4762.48682529 hartree
twoeener: 2058.46107302 hartree
cpcmener: -0.03675794 hartree
kineticenergy: 968.95913665 hartree
xcener: -93.277900874817 hartree
chargesum: -0.0000000
charge: -0.453901 -0.278555 -0.421989 -0.392615 -0.089300 -0.402664 0.345233 0.064218 0.177141 -0.333839 -0.309738 -0.309141 0.259865 0.175843 -0.091343 -0.052808 -0.042478 -0.008740 -0.024932 0.394743 -0.284513 0.048235 0.105476 0.114858 0.107559 0.097698 0.084817 0.100518 0.094635 0.081683 0.096109 0.177518 0.133931 0.126305 0.087394 0.087636 0.096509 0.089424 0.089035 0.260175
qa: -0.4539 -0.2786 -0.4220 -0.3926 -0.0893 -0.4027 0.3452 0.0642 0.1771 -0.3338 -0.3097 -0.3091 0.2599 0.1758 -0.0913 -0.0528 -0.0425 -0.0087 -0.0249 0.3947 -0.2845 0.0482 0.1055 0.1149 0.1076 0.0977 0.0848 0.1005 0.0946 0.0817 0.0961 0.1775 0.1339 0.1263 0.0874 0.0876 0.0965 0.0894 0.0890 0.2602
va: 2.0781 2.2174 2.0700 3.0165 3.2220 3.0294 3.6178 3.7925 4.2882 3.9766 3.9436 3.9550 4.2846 3.7628 3.8753 3.7836 3.9187 4.1150 3.8426 4.3683 3.9532 1.0306 1.0021 1.0000 1.0078 1.0074 1.0104 1.0043 0.9998 1.0132 1.0052 1.0308 1.0072 1.0055 1.0009 1.0008 1.0051 0.9969 0.9971 0.9918
dispcorr: -0.019903313 hartree
energy: -973.161567313761
dipole: -0.39097 -2.44155 -2.83252 -6.26505 5.72191 -0.54313 3.65272 -4.37858 -0.72586
magnitude: 2.97406 au
magnitude: 7.55945 debye
