program: Orca
programVersion: 5.0.2
elementType: O O O N N N C C C C C C C C C C C C C C C H H H H H H H H H H H H H H H H H H H
charge: 0
multiplicity: 1
keywords: wb97x-d3
keywords: def2-TZVPP
keywords: def2/J RIJCOSX
keywords: DEFGRID2
keywords: scfconv7
keywords: smallprint printgap noloewdin
keywords: NOSOSCF
formula: C15H19N3O3
InChI: InChI=1/C15H19N3O3/c1-5-9-6-10(13(19)20)11(16-7-9)12-17-14(21)15(4,18-12)8(2)3/h6-8,17,19H,5H2,1-4H3
40 atoms
O  3.35645 2.540421 -0.183596
O  -0.549094 -2.580929 0.691461
O  -0.623479 -2.544309 -1.545903
N  1.354987 -0.379266 -0.309983
N  1.159088 1.846555 -0.193607
N  -1.570163 1.644494 -0.139143
C  2.706198 0.160239 -0.288404
C  3.479981 -0.34116 0.953482
C  2.510921 1.674086 -0.209872
C  3.421476 -0.175356 -1.595638
C  2.81248 0.080321 2.258877
C  3.677678 -1.851818 0.931167
C  0.554912 0.606405 -0.251315
C  -0.906909 0.500117 -0.236092
C  -1.549907 -0.73213 -0.320639
C  -3.640867 0.449035 -0.19567
C  -2.935996 -0.742695 -0.303855
C  -2.891067 1.619101 -0.116399
C  -5.136405 0.475453 -0.113798
C  -0.829469 -2.033372 -0.476962
C  -5.626045 0.237882 1.312247
H  4.464069 0.137016 0.904677
H  3.433147 -1.250608 -1.76491
H  2.921145 0.286304 -2.448047
H  4.451373 0.181936 -1.571509
H  2.716748 1.162997 2.356709
H  1.819515 -0.359516 2.366568
H  3.409053 -0.258431 3.107233
H  2.722299 -2.378545 0.934497
H  4.230434 -2.166757 1.817714
H  4.246217 -2.189301 0.064788
H  0.667639 2.728499 -0.153414
H  -3.471869 -1.682488 -0.375129
H  -3.390334 2.578944 -0.034357
H  -5.50442 1.438908 -0.471749
H  -5.551658 -0.287623 -0.775197
H  -6.715648 0.251869 1.352117
H  -5.257277 1.008107 1.990904
H  -5.291202 -0.728504 1.691515
H  -0.099015 -3.433277 0.565544
elementType: O N C H
totalener: -973.14246740 hartree
nucrepener: 1731.96099243 hartree
electener: -2705.10345983 hartree
oneelecener: -4764.44143946 hartree
twoeener: 2059.33797963 hartree
cpcmener: -0.03724559 hartree
kineticenergy: 968.96968287 hartree
xcener: -93.277350519162 hartree
chargesum: -0.0000000
charge: -0.453638 -0.283380 -0.413708 -0.395290 -0.088836 -0.403993 0.346801 0.061042 0.177866 -0.333139 -0.310232 -0.310490 0.265497 0.172326 -0.092097 -0.034502 -0.050824 0.013059 -0.084824 0.394539 -0.256115 0.048918 0.106228 0.114660 0.107162 0.098119 0.083809 0.101325 0.080868 0.095980 0.095990 0.177414 0.144312 0.126600 0.080326 0.082892 0.095456 0.088453 0.087200 0.264227
qa: -0.4536 -0.2834 -0.4137 -0.3953 -0.0888 -0.4040 0.3468 0.0610 0.1779 -0.3331 -0.3102 -0.3105 0.2655 0.1723 -0.0921 -0.0345 -0.0508 0.0131 -0.0848 0.3945 -0.2561 0.0489 0.1062 0.1147 0.1072 0.0981 0.0838 0.1013 0.0809 0.0960 0.0960 0.1774 0.1443 0.1266 0.0803 0.0829 0.0955 0.0885 0.0872 0.2642
va: 2.0785 2.2046 2.0820 3.0102 3.2231 3.0336 3.6219 3.7944 4.2875 3.9755 3.9449 3.9563 4.2653 3.7763 3.8311 3.7452 3.9564 4.0776 3.8700 4.3718 3.9171 1.0306 1.0019 1.0003 1.0076 1.0073 1.0099 1.0043 1.0124 1.0049 1.0001 1.0310 1.0034 1.0060 1.0064 1.0043 1.0046 1.0017 1.0028 0.9871
dispcorr: -0.020082415 hartree
energy: -973.162549814085
dipole: 0.11739 -2.78019 -2.66281 -4.44891 3.70900 -0.73992 8.93551 -7.97096 0.96455
magnitude: 2.92718 au
magnitude: 7.44030 debye
