program: Gaussian 09
title: 000068911
version: EM64L-G09RevD.01
frameworkgroup: C1[X(C16H26O5)]
method: RPBEPBE
basis: SDD
operation: Freq
keyword: #pfreq=noraman
keyword: PBEPBE/SDD
title: #p freq=noraman PBEPBE/SDD
converged: YES YES NO NO
title: Mulliken charges:
elementType: O O O O O C C C C C C C C C C C C C C C C H H H H H H H H H H H H H H H H H H H H H H H H H H
charge: -0.193498 -0.263967 -0.206065 -0.149471 -0.290536 0.127277 -0.077009 -0.177652 -0.033510 -0.123654 -0.484931 -0.079994 -0.477750 -0.455051 0.362037 -0.475788 -0.074039 -0.769661 -0.766138 -0.762904 -0.506590 0.228165 0.233046 0.209755 0.251488 0.216722 0.258917 0.270005 0.217239 0.224071 0.201043 0.190341 0.208797 0.238191 0.214459 0.211713 0.231309 0.214904 0.247498 0.210627 0.213161 0.256154 0.230081 0.227954 0.226886 0.206920 0.239451
chargesum: 0.00000
title: Mulliken charges with hydrogens summed into heavy atoms:
elementType: O O O O O C C C C C C C C C C C C C C C C
charge: -0.193498 -0.263967 -0.206065 -0.149471 -0.290536 0.127277 0.151156 0.055394 0.176244 0.127834 -0.009292 0.190011 -0.036441 -0.063667 0.362037 -0.028800 0.140420 -0.111735 -0.094853 -0.048715 0.166667
polarizability: 2.05281459e+02 -6.86731468e+00 1.91148762e+02 -4.28573183e+00 -7.47521277e-01 1.52929245e+02
1716.lowfreq: -14.5845 0.0001 0.0004 0.0006 14.5446 22.5097 63.7565 82.2605 90.5053
frequency: 63.6330 82.1744 90.4609 103.6351 127.4887 148.4710 169.8636 185.5150 196.6120 201.9123 204.3424 223.9032 226.3450 243.1936 249.2733 255.7678 265.8769 287.7968 302.7900 314.8155 339.8990 359.9858 397.8136 400.1214 421.8695 433.8143 456.5301 466.6556 470.3650 506.9788 516.8805 545.3917 572.7956 607.3657 620.7258 633.2748 681.4951 715.8823 762.0056 792.2376 793.8550 831.9059 839.4994 841.6819 845.4216 874.2827 884.9554 911.7985 917.0734 935.5828 939.3858 958.1202 966.2664 977.5543 982.7317 1016.9497 1022.4524 1035.0661 1042.9536 1055.6573 1072.3328 1076.0707 1086.1058 1112.2464 1113.0407 1121.1512 1125.7114 1138.2693 1151.7675 1155.3929 1167.6262 1183.1868 1203.5525 1211.9416 1219.7404 1243.9801 1256.5276 1270.0202 1283.0234 1289.1013 1294.7863 1308.0804 1314.8225 1319.8179 1331.4828 1333.7928 1336.0164 1343.7461 1348.4290 1351.4820 1357.2950 1363.0630 1367.4434 1383.4270 1385.2130 1391.0255 1428.3817 1451.8620 1452.5390 1453.5121 1455.8931 1464.4467 1467.4089 1471.6674 1475.9120 1480.3462 1481.9839 1485.6539 1493.2044 2935.3926 2949.4956 2952.8431 2954.0682 2961.8088 2971.5990 2979.9439 2982.0647 2990.1820 3001.3110 3002.1332 3005.9405 3006.8317 3009.1578 3023.9685 3047.0869 3047.3941 3061.1630 3063.3041 3065.7910 3066.7904 3079.6522 3097.2064 3108.9775 3112.2285 3118.4509
redmass: 3.3881 3.5578 3.2418 2.3981 1.5734 3.0206 2.4166 2.1554 1.6972 1.6305 2.2475 1.2919 1.7413 2.2444 1.6261 4.0273 3.6082 3.1752 3.2197 3.3838 4.7928 2.8834 3.6137 4.4726 3.3247 3.2908 3.8845 4.7437 3.3193 6.1008 4.2668 3.1698 3.2864 3.0792 5.0798 3.4182 4.7411 4.0645 3.3971 5.5389 3.9460 2.7856 2.0305 2.8385 3.8835 2.7032 2.5653 2.6170 3.2618 1.7280 2.1566 2.5087 2.2805 1.8805 1.9524 3.0069 2.4672 2.7758 1.8691 2.0655 2.1919 2.2977 2.4953 2.7354 1.3989 2.7886 2.0632 1.6851 2.0288 1.7601 2.7320 2.0398 1.8339 2.4817 1.6881 1.3915 1.4059 1.4858 1.3340 1.1957 1.2631 1.2346 1.2652 1.3009 1.2834 1.4020 1.4437 1.4336 1.4154 1.5769 1.4082 1.4230 1.4933 1.2334 1.2077 1.2115 1.1467 1.0720 1.0593 1.0517 1.0826 1.0848 1.0501 1.0487 1.0579 1.0535 1.0477 1.0754 1.0622 1.0804 1.0821 1.0354 1.0745 1.0714 1.0377 1.0622 1.0594 1.0597 1.0648 1.0577 1.0395 1.0841 1.0837 1.0957 1.1009 1.0991 1.0994 1.1006 1.1013 1.0990 1.0982 1.0986 1.1001 1.1014 1.1004
irintensity: 0.6896 0.4389 0.5081 2.8584 1.5472 2.6512 6.1834 4.8716 1.1573 0.6571 1.0045 0.4678 1.0706 0.2733 0.1662 0.8808 1.1659 2.4933 0.2534 4.0527 2.0610 1.3342 3.8981 2.2757 0.9476 5.2161 4.7312 7.7687 2.3502 2.8838 3.8197 0.2300 3.4718 2.4967 1.6850 0.3022 0.1181 9.8232 46.2479 25.2335 3.2160 33.3048 11.5467 4.5532 60.0951 64.3127 3.6488 18.1160 175.5866 14.4270 118.0878 76.7542 12.4526 16.1714 14.6894 56.2295 12.0046 25.8634 6.0347 6.2762 15.0438 34.1744 18.3708 2.1021 3.0025 25.7408 2.7518 8.9358 11.9992 4.5133 2.8485 21.3703 4.3668 16.9079 9.5299 4.8665 1.5358 4.2093 1.1979 3.2241 0.6357 3.0002 1.3763 3.7899 13.1988 10.4199 0.4956 3.0420 3.2477 6.6504 2.9205 4.2867 5.7539 26.6180 13.9627 15.9181 5.8972 7.9918 11.0721 9.2438 8.6886 4.1124 10.2765 10.5465 9.6284 12.2274 10.5062 12.5616 3.4730 3.6605 12.4468 74.4188 6.6144 61.9914 53.9439 19.0732 68.2985 24.3891 15.6412 24.4767 30.3877 7.8243 25.1601 47.7069 32.8509 30.4662 27.5173 39.8474 26.6335 47.8371 35.1681 21.2718 13.4093 23.3671 12.5125
temp: 298.150 k
press: 1.00000 atm
elementType: 8 8 8 8 8 6 6 6 6 6 6 6 6 6 6 6 6 6 6 6 6 1 1 1 1 1 1 1 1 1 1 1 1 1 1 1 1 1 1 1 1 1 1 1 1 1 1
symmnumber: 1
zpe: 1052638.8 jmol-1
zpe.correction: 0.400929 hartree
zpe.thermalcorrener: 0.421152 hartree
zpe.thermalcorrenthalpy: 0.422096 hartree
zpe.thermalcorrgfe: 0.355364 hartree
zpe.sumelectzpe: -999.656522 hartree
zpe.sumelectthermal: -999.636299 hartree
zpe.sumelectthermalent: -999.635355 hartree
zpe.sumelectthermalfe: -999.702087 hartree
dipole: 0.0267 1.9053 -1.2108
dipole: 2.2576
quadrupole: -115.5508 -125.5760 -128.0761
quadrupole: 2.7319 -0.0084 2.4955
quadrupole: 7.5168 -2.5084 -5.0085 2.7319 -0.0084 2.4955
hfenergy: -1000.0574506 hartree
pointgroup: C01 [X(C16H26O5)]
dipole: -0.0065608 -0.7452753 -0.4831608 debye
polarizability: 205.7623439|-6.5533333|190.8334535|2.8265397|1.3591608|152.763669 unknown
InChI: InChI=1S/C16H26O5/c1-9-5-6-12-10(2)13(17-4)18-14-16(12)11(9)7-8-15(3,19-14)20-21-16/h9-14H,5-8H2,1-4H3
charge 0 multiplicity 1
47 atoms
O  -0.785258 0.465841 1.682789
O  -1.325547 1.375253 -1.081268
O  0.893851 1.758653 -0.486934
O  -1.393346 1.823201 1.28448
O  2.913066 0.599497 -1.137491
C  -0.260826 -0.279103 0.469405
C  -1.296426 -1.422278 0.20107
C  1.122433 -0.818788 0.948188
C  -0.723204 -2.566497 -0.694763
C  -0.101743 0.693772 -0.731905
C  1.651009 -1.948761 0.026604
C  2.111178 0.362709 1.173545
C  -2.653328 -0.903833 -0.350016
C  0.618975 -3.080336 -0.124672
C  -2.222119 1.615929 0.093525
C  -3.182361 0.409587 0.267482
C  2.210571 1.285816 -0.054497
C  -1.726265 -3.73341 -0.849784
C  3.50407 -0.084129 1.661176
C  -2.89787 2.962368 -0.142164
C  3.242824 1.495149 -2.257007
H  -1.477621 -1.857226 1.208639
H  0.932529 -1.271413 1.946172
H  -0.526539 -2.146592 -1.706513
H  0.203578 0.127468 -1.632319
H  2.58417 -2.351415 0.462364
H  1.925374 -1.534932 -0.960229
H  1.646847 0.997069 1.95408
H  -3.416242 -1.686282 -0.181855
H  -2.570264 -0.765148 -1.444869
H  1.021426 -3.869444 -0.789872
H  0.432984 -3.557699 0.861313
H  -4.143935 0.659473 -0.219483
H  -3.379063 0.290558 1.348666
H  2.741864 2.227611 0.195599
H  -2.033223 -4.119864 0.141795
H  -2.637638 -3.436102 -1.396702
H  -1.261125 -4.568585 -1.40613
H  4.063986 -0.600951 0.864406
H  4.10339 0.789395 1.979263
H  3.413667 -0.762188 2.530263
H  -2.152747 3.771972 -0.0833
H  -3.339092 2.963282 -1.153138
H  -3.69243 3.135594 0.60279
H  3.747418 0.868223 -3.008482
H  3.927061 2.30316 -1.925272
H  2.329841 1.947895 -2.686347
