program: Orca
programVersion: 5.0.2
elementType: O O O N N N C C C C C C C C C C C C C C C H H H H H H H H H H H H H H H H H H H
charge: 0
multiplicity: 1
keywords: wb97x-d3
keywords: def2-TZVPP
keywords: def2/J RIJCOSX
keywords: DEFGRID2
keywords: scfconv7
keywords: smallprint printgap noloewdin
keywords: NOSOSCF
formula: C15H19N3O3
InChI: InChI=1/C15H19N3O3/c1-5-9-6-10(13(19)20)11(16-7-9)12-17-14(21)15(4,18-12)8(2)3/h6-8,17,19H,5H2,1-4H3
40 atoms
O  3.257873 2.593469 -0.043139
O  -0.49556 -2.456246 -1.531408
O  -0.436887 -2.809991 0.679808
N  1.348567 -0.376359 -0.352303
N  1.07955 1.825944 -0.05031
N  -1.642362 1.506795 0.040188
C  2.6796 0.20822 -0.344016
C  3.521473 -0.382256 0.808894
C  2.447928 1.709178 -0.122483
C  3.338306 0.01616 -1.709537
C  2.886834 -0.117687 2.171837
C  3.758117 -1.878138 0.6305
C  0.522364 0.572208 -0.180887
C  -0.931361 0.400348 -0.103165
C  -1.514978 -0.86523 -0.159686
C  -3.655568 0.216585 0.079505
C  -2.890809 -0.938074 -0.059125
C  -2.960513 1.419123 0.123924
C  -5.153747 0.118079 0.178534
C  -0.72492 -2.132973 -0.264007
C  -5.90521 1.438689 0.225673
H  4.484796 0.137519 0.77289
H  3.390934 -1.039677 -1.96663
H  2.768076 0.516489 -2.492797
H  4.345891 0.431162 -1.706156
H  1.919923 -0.614995 2.261162
H  3.52762 -0.507892 2.963308
H  2.749852 0.945577 2.372932
H  4.310362 -2.110883 -0.279656
H  2.812319 -2.420353 0.606957
H  4.342729 -2.266006 1.465561
H  0.552004 2.67252 0.089148
H  -3.38234 -1.904137 -0.089673
H  -3.485673 2.360283 0.233991
H  -5.514475 -0.469966 -0.670099
H  -5.401638 -0.470378 1.06685
H  -6.977961 1.256312 0.269787
H  -5.713702 2.046176 -0.659335
H  -5.641488 2.028709 1.103797
H  0.050992 -3.253465 -1.549355
totalener: -973.11260959 hartree
nucrepener: 1730.90453279 hartree
electener: -2704.01714237 hartree
oneelecener: -4762.03125282 hartree
twoeener: 2058.01411045 hartree
kineticenergy: 969.02925538 hartree
xcener: -93.280778048422 hartree
chargesum: 0.0000000
charge: -0.331680 -0.243075 -0.322657 -0.361123 -0.110461 -0.375614 0.317089 0.061907 0.121160 -0.316320 -0.304184 -0.293822 0.268532 0.142587 -0.048260 -0.028145 -0.057838 -0.007216 -0.055068 0.321785 -0.278570 0.052779 0.094972 0.100160 0.108504 0.091033 0.088627 0.095502 0.079343 0.094216 0.084040 0.157323 0.111390 0.100751 0.082063 0.087249 0.094144 0.089208 0.084788 0.204879
qa: -0.3317 -0.2431 -0.3227 -0.3611 -0.1105 -0.3756 0.3171 0.0619 0.1212 -0.3163 -0.3042 -0.2938 0.2685 0.1426 -0.0483 -0.0281 -0.0578 -0.0072 -0.0551 0.3218 -0.2786 0.0528 0.0950 0.1002 0.1085 0.0910 0.0886 0.0955 0.0793 0.0942 0.0840 0.1573 0.1114 0.1008 0.0821 0.0872 0.0941 0.0892 0.0848 0.2049
va: 2.2019 2.2283 2.1725 3.0060 3.2032 3.0585 3.6813 3.8050 4.3206 3.9764 3.9561 3.9530 4.2333 3.7954 3.8532 3.7415 3.9971 4.1079 3.8407 4.4031 3.9610 1.0297 1.0053 1.0053 1.0091 1.0097 1.0073 1.0073 1.0021 1.0108 1.0096 1.0454 1.0125 1.0102 0.9993 0.9971 1.0079 0.9972 0.9968 1.0408
dispcorr: -0.019997100 hartree
energy: -973.132606689813
dipole: -0.29388 -1.71343 -2.00731 -2.11191 1.62902 -0.48289 3.55799 -4.04539 -0.48740
magnitude: 2.12133 au
magnitude: 5.39200 debye
