program: Orca
programVersion: 5.0.2
elementType: O O O N N N C C C C C C C C C C C C C C C C C H H H H H H H H H H H H H H H H H
charge: 0
multiplicity: 1
keywords: wb97x-d3
keywords: def2-TZVPP
keywords: def2/J RIJCOSX
keywords: DEFGRID2
keywords: scfconv7
keywords: smallprint printgap noloewdin
keywords: NOSOSCF
formula: C17H17N3O3
InChI: InChI=1/C17H17N3O3/c1-9(2)17(3)16(23)19-14(20-17)13-11(15(21)22)8-10-6-4-5-7-12(10)18-13/h4-9,19,21H,1-3H3
40 atoms
O  3.101616 2.812856 -0.07578
O  0.456885 -2.7114 -0.868581
O  -0.043884 -3.173632 1.263752
N  1.663728 -0.390947 0.433948
N  1.084028 1.702317 -0.103782
N  -1.542929 1.010464 -0.046995
C  2.895392 0.387933 0.399277
C  3.832625 -0.213956 -0.677063
C  2.445449 1.811621 0.042161
C  3.527168 0.378329 1.789697
C  3.213742 -0.16626 -2.071663
C  5.221401 0.417646 -0.691471
C  0.713707 0.397464 0.140539
C  -0.703597 0.018156 0.075065
C  -1.106598 -1.337103 0.193591
C  -2.867824 0.762553 -0.051559
C  -3.378695 -0.548787 0.099352
C  -2.446659 -1.597525 0.229888
C  -0.153158 -2.485011 0.291286
C  -3.765004 1.84231 -0.198132
C  -4.774756 -0.751451 0.103155
C  -5.112863 1.616735 -0.193766
C  -5.622888 0.310754 -0.04195
H  3.938652 -1.266659 -0.392211
H  2.797883 0.662058 2.547968
H  3.885489 -0.622738 2.029779
H  4.361054 1.075211 1.847524
H  3.854358 -0.690847 -2.78167
H  2.234908 -0.643434 -2.10532
H  3.112608 0.858989 -2.433805
H  5.82967 -0.053372 -1.464767
H  5.747754 0.285915 0.253199
H  5.180116 1.484432 -0.907383
H  0.439537 2.448385 -0.309204
H  -2.802774 -2.614925 0.340764
H  -3.357591 2.838031 -0.309423
H  -5.163717 -1.755265 0.219804
H  -5.799261 2.44528 -0.305951
H  -6.692978 0.153345 -0.040459
H  1.102919 -3.418685 -0.741649
totalener: -1048.12257302 hartree
nucrepener: 1917.23356012 hartree
electener: -2965.35613314 hartree
oneelecener: -5234.24514333 hartree
twoeener: 2268.88901019 hartree
kineticenergy: 1043.78023831 hartree
xcener: -100.411672163695 hartree
chargesum: 0.0000000
charge: -0.341795 -0.250547 -0.316154 -0.328577 -0.108986 -0.360053 0.351512 0.001575 0.119640 -0.303308 -0.293375 -0.278666 0.235630 0.138523 -0.060102 0.103422 0.015961 0.028348 0.318495 -0.218775 -0.128812 -0.085063 -0.110134 0.038954 0.100882 0.103900 0.102533 0.087824 0.093676 0.091769 0.081552 0.080592 0.105119 0.154549 0.113651 0.126588 0.120820 0.130862 0.131070 0.206903
qa: -0.3418 -0.2505 -0.3162 -0.3286 -0.1090 -0.3601 0.3515 0.0016 0.1196 -0.3033 -0.2934 -0.2787 0.2356 0.1385 -0.0601 0.1034 0.0160 0.0283 0.3185 -0.2188 -0.1288 -0.0851 -0.1101 0.0390 0.1009 0.1039 0.1025 0.0878 0.0937 0.0918 0.0816 0.0806 0.1051 0.1545 0.1137 0.1266 0.1208 0.1309 0.1311 0.2069
va: 2.1771 2.1951 2.1801 2.9705 3.2169 3.0637 3.6478 3.9122 4.3161 3.9631 3.9373 3.9501 4.1558 3.8616 3.8542 4.0559 3.8088 3.9178 4.3917 4.0667 3.9501 3.9588 3.9643 1.0255 1.0095 1.0040 1.0048 1.0057 1.0140 1.0069 1.0062 1.0045 1.0143 1.0471 1.0192 1.0220 1.0143 0.9986 1.0006 1.0383
dispcorr: -0.020385268 hartree
energy: -1048.142958288495
dipole: 17.83818 -19.43397 -1.59580 1.35253 -1.84933 -0.49680 -4.14893 3.55934 -0.58959
magnitude: 1.77229 au
magnitude: 4.50479 debye
