program: Orca
programVersion: 5.0.2
elementType: O O O N N N C C C C C C C C C C C C C H H H H H H H H H H H H H H H
charge: 0
multiplicity: 1
keywords: wb97x-d3
keywords: def2-TZVPP
keywords: def2/J RIJCOSX
keywords: DEFGRID2
keywords: scfconv7
keywords: smallprint printgap noloewdin
keywords: NOSOSCF
formula: C13H15N3O3
InChI: InChI=1/C13H15N3O3/c1-7(2)13(3)12(19)15-10(16-13)9-8(11(17)18)5-4-6-14-9/h4-7,15,17H,1-3H3
34 atoms
O  -2.865082 2.304994 -0.087107
O  1.18423 -2.42983 -0.810246
O  1.686178 -2.544452 1.370776
N  -0.642803 -0.392389 0.510168
N  -0.638038 1.741842 -0.160405
N  2.099548 1.769077 -0.16846
C  -2.035505 0.038508 0.46442
C  -2.788349 -0.829381 -0.5776
C  -1.962392 1.501526 0.037675
C  -2.647077 -0.060867 1.858413
C  -4.296111 -0.602396 -0.588407
C  -2.221018 -0.666981 -1.985421
C  0.068763 0.593121 0.133917
C  1.531573 0.58388 0.022807
C  2.265164 -0.593978 0.143031
C  3.649801 -0.504252 0.099969
C  3.42008 1.839252 -0.233521
C  4.239977 0.731435 -0.093365
C  1.654191 -1.944951 0.325641
H  -2.61134 -1.861286 -0.258071
H  -3.644168 0.374598 1.884257
H  -2.72159 -1.104339 2.164629
H  -2.034701 0.466694 2.589742
H  -4.561333 0.417795 -0.868159
H  -4.754868 -1.267078 -1.322179
H  -4.759167 -0.820735 0.373341
H  -1.146813 -0.848476 -2.028856
H  -2.415806 0.328699 -2.391352
H  -2.693845 -1.382057 -2.659651
H  -0.226351 2.621935 -0.438002
H  4.259155 -1.392975 0.200628
H  3.844596 2.821171 -0.400686
H  5.314517 0.834886 -0.141641
H  0.809437 -3.315082 -0.672856
elementType: O N C H
totalener: -894.49957146 hartree
nucrepener: 1481.69984442 hartree
electener: -2376.19941588 hartree
oneelecener: -4160.32373052 hartree
twoeener: 1784.12431464 hartree
cpcmener: -0.04384464 hartree
kineticenergy: 890.72536602 hartree
xcener: -84.917190814900 hartree
chargesum: 0.0000000
charge: -0.492039 -0.285537 -0.442989 -0.373056 -0.085461 -0.405108 0.379466 0.025999 0.192960 -0.322065 -0.309925 -0.307570 0.268843 0.162325 -0.110089 -0.053116 0.019635 -0.145284 0.414962 0.049284 0.101407 0.111391 0.114497 0.086763 0.098051 0.097505 0.093383 0.092913 0.102514 0.180069 0.159634 0.144533 0.164325 0.271779
qa: -0.4920 -0.2855 -0.4430 -0.3731 -0.0855 -0.4051 0.3795 0.0260 0.1930 -0.3221 -0.3099 -0.3076 0.2688 0.1623 -0.1101 -0.0531 0.0196 -0.1453 0.4150 0.0493 0.1014 0.1114 0.1145 0.0868 0.0981 0.0975 0.0934 0.0929 0.1025 0.1801 0.1596 0.1445 0.1643 0.2718
va: 2.0180 2.1955 2.0441 2.9986 3.2471 3.0238 3.6120 3.8603 4.2608 3.9662 3.9528 3.9364 4.1920 3.8062 3.8156 3.9338 4.0437 3.9012 4.3259 1.0274 1.0041 1.0025 1.0031 1.0149 1.0035 0.9996 1.0133 1.0037 1.0034 1.0290 0.9972 0.9962 0.9899 0.9809
dispcorr: -0.017252219 hartree
energy: -894.516823682213
dipole: -16.51602 18.81592 2.29991 -3.77639 3.16702 -0.60937 -3.79119 2.68813 -1.10307
magnitude: 2.62253 au
magnitude: 6.66594 debye
