program: Orca
programVersion: 5.0.2
elementType: O O O O N N N C C C C C C C C C C C C C C C H H H H H H H H H H H H H H H H H H H
charge: 0
multiplicity: 1
keywords: wb97x-d3
keywords: def2-TZVPP
keywords: def2/J RIJCOSX
keywords: DEFGRID2
keywords: scfconv7
keywords: smallprint printgap noloewdin
keywords: NOSOSCF
formula: C15H19N3O4
InChI: InChI=1/C15H19N3O4/c1-8(2)15(3)14(21)17-12(18-15)11-10(13(19)20)5-9(6-16-11)7-22-4/h5-6,8,17,19H,7H2,1-4H3
41 atoms
O  3.824897 2.303421 0.196464
O  -5.409216 -0.394085 0.07381
O  -0.216364 -2.465887 0.705991
O  -0.66145 -2.523117 -1.489801
N  1.630503 -0.387136 -0.522398
N  1.597705 1.734345 0.186966
N  -1.148247 1.739033 0.138887
C  3.019404 0.047673 -0.427376
C  3.744029 -0.839699 0.618447
C  2.92837 1.501667 0.025818
C  3.6720 -0.021068 -1.804485
C  5.248588 -0.603784 0.68523
C  3.129654 -0.715626 2.009972
C  0.903776 0.587958 -0.147347
C  -0.559186 0.565479 -0.068494
C  -1.282938 -0.610684 -0.224054
C  -2.669866 -0.541182 -0.197798
C  -3.287548 0.679671 0.014032
C  -2.46591 1.790028 0.187126
C  -0.659423 -1.952818 -0.427968
C  -4.774617 0.854922 0.053575
C  -6.814616 -0.276936 0.070934
H  3.584705 -1.864626 0.268756
H  3.761125 -1.058211 -2.127944
H  3.07662 0.516569 -2.542799
H  4.666764 0.420781 -1.793985
H  5.688242 -1.291328 1.409171
H  5.743215 -0.784871 -0.268345
H  5.496755 0.406734 1.009739
H  2.056726 -0.908461 2.013375
H  3.30081 0.27118 2.446099
H  3.587458 -1.44283 2.68149
H  1.174931 2.605921 0.474358
H  -3.25167 -1.443791 -0.328168
H  -2.9029 2.765364 0.371837
H  -5.044529 1.452533 0.935489
H  -5.086562 1.441812 -0.822424
H  0.168838 -3.344646 0.554828
H  -7.180718 0.262875 0.951076
H  -7.232872 -1.282221 0.082947
H  -7.178574 0.241662 -0.822722
elementType: O N C H
totalener: -1048.35131433 hartree
nucrepener: 1848.98042208 hartree
electener: -2897.33173642 hartree
oneelecener: -5101.79169521 hartree
twoeener: 2204.45995879 hartree
cpcmener: -0.04919129 hartree
kineticenergy: 1043.89681475 hartree
xcener: -99.370597491615 hartree
chargesum: 0.0000000
charge: -0.492241 -0.373519 -0.285952 -0.442808 -0.373378 -0.085930 -0.400949 0.380473 0.026283 0.192116 -0.322580 -0.309518 -0.307522 0.235878 0.161988 -0.080163 -0.074087 0.002514 -0.005479 0.403225 0.089603 -0.115892 0.049090 0.111495 0.114377 0.101155 0.098179 0.097052 0.086645 0.092972 0.092775 0.102716 0.179554 0.137135 0.131940 0.099341 0.101871 0.271507 0.096301 0.115808 0.098022
qa: -0.4922 -0.3735 -0.2860 -0.4428 -0.3734 -0.0859 -0.4009 0.3805 0.0263 0.1921 -0.3226 -0.3095 -0.3075 0.2359 0.1620 -0.0802 -0.0741 0.0025 -0.0055 0.4032 0.0896 -0.1159 0.0491 0.1115 0.1144 0.1012 0.0982 0.0971 0.0866 0.0930 0.0928 0.1027 0.1796 0.1371 0.1319 0.0993 0.1019 0.2715 0.0963 0.1158 0.0980
va: 2.0180 1.9377 2.1966 2.0439 2.9989 3.2469 3.0324 3.6119 3.8603 4.2634 3.9654 3.9534 3.9358 4.2619 3.8063 3.8440 3.9757 3.7043 4.1125 4.3391 3.9143 3.8998 1.0274 1.0024 1.0030 1.0043 1.0034 0.9998 1.0147 1.0137 1.0038 1.0033 1.0288 1.0340 1.0056 0.9905 0.9881 0.9811 0.9888 0.9921 0.9901
dispcorr: -0.020166256 hartree
energy: -1048.371480587213
dipole: 4.37655 -7.38473 -3.00818 -2.67065 2.69451 0.02387 4.32506 -3.29236 1.03270
magnitude: 3.18059 au
magnitude: 8.08442 debye
