program: Gaussian 09
title: 000007561
version: EM64L-G09RevD.01
frameworkgroup: C1[X(C10H16O2)]
method: RPBEPBE
basis: SDD
operation: Freq
keyword: #pfreq=noraman
keyword: PBEPBE/SDD
title: #p freq=noraman PBEPBE/SDD
converged: YES YES NO NO
title: Mulliken charges:
elementType: O O C C C C C C C C C C H H H H H H H H H H H H H H H H
charge: -0.301051 -0.257168 -0.000062 -0.447937 -0.435819 -0.383351 -0.392829 -0.384071 0.174547 0.338859 -0.759622 -0.636310 0.248103 0.244630 0.200239 0.194577 0.215138 0.206835 0.199380 0.198711 0.212736 0.188780 0.201856 0.240248 0.236293 0.214721 0.227391 0.255176
chargesum: 0.00000
title: Mulliken charges with hydrogens summed into heavy atoms:
elementType: O O C C C C C C C C C C
charge: -0.301051 -0.257168 0.248040 -0.003068 -0.026103 0.022864 0.018618 0.006565 0.174547 0.338859 -0.068360 -0.153743
polarizability: 1.45656496e+02 -4.44186406e+00 1.04853334e+02 6.28873803e+00 3.98448163e-01 8.61102748e+01
1716.lowfreq: -13.0958 -0.0008 0.0003 0.0004 2.9093 14.7444 36.7686 56.4784 72.2404
frequency: 36.5441 56.2656 72.2016 90.3014 165.7724 174.9655 204.4545 238.0257 291.6153 349.1175 357.4216 383.5881 403.1886 458.7145 472.7383 480.8695 574.2635 630.3745 645.8561 774.6662 784.7575 790.1220 796.1882 830.7132 865.6496 871.4811 895.0659 927.2333 947.0755 987.3519 1007.1724 1012.3922 1048.5203 1052.0088 1053.3943 1087.0221 1108.9633 1117.7992 1130.1686 1164.4279 1235.2211 1259.9590 1268.0892 1285.9791 1317.8264 1323.8002 1333.3373 1341.0146 1350.8984 1360.5199 1362.1422 1394.6442 1413.5766 1450.8689 1456.0402 1460.4163 1464.0434 1469.8370 1471.1193 1478.8520 1601.3382 1653.2387 2962.2746 2977.9096 2981.1760 2983.8085 2987.0724 2988.7422 3029.0529 3033.3281 3039.6133 3045.5753 3052.3912 3057.8862 3072.0236 3096.9066 3103.0408 3215.1894
redmass: 3.1782 3.6183 4.6715 3.6249 2.4885 1.1792 2.4001 3.6496 2.4682 2.0993 2.9748 2.2972 3.1604 2.9477 3.5679 2.1059 3.8189 1.7838 2.2511 1.5497 2.0780 3.4919 2.9398 3.7138 2.0864 1.9094 2.8826 1.3975 1.9393 1.3191 1.5382 2.3453 1.6764 1.4378 1.4919 1.6435 3.1240 1.0391 2.6520 1.7139 1.2896 1.2467 1.2563 2.6622 1.6887 1.6144 1.3982 1.4496 1.4483 1.4578 1.4381 1.1649 1.2511 1.0877 1.0463 1.0874 1.0844 1.0812 1.0643 1.0890 11.3929 5.1805 1.0634 1.0645 1.0626 1.0626 1.0619 1.0363 1.0937 1.0894 1.0995 1.0992 1.1008 1.1002 1.0970 1.1008 1.0617 1.1156
irintensity: 0.4009 1.6160 1.7423 0.6444 1.8093 1.2805 1.9420 4.0646 1.8036 1.2067 5.7950 0.9973 0.3877 6.1206 1.2095 0.6589 2.0348 6.6333 4.0320 0.6726 8.6042 1.0409 5.7535 6.9944 12.9242 14.2720 32.1557 8.8352 8.1665 59.3042 34.4556 7.1701 8.2388 7.5938 6.9041 0.2078 318.3593 1.2221 130.0454 5.3963 2.8932 1.9505 8.0654 102.8800 2.0330 4.7162 0.2565 0.3812 0.2836 1.1356 2.4817 22.2006 11.6841 8.0992 14.8439 8.4784 12.3232 13.5372 50.9920 6.2236 134.3982 3.3817 39.5192 7.0715 45.9301 15.7125 35.1097 18.9622 81.7845 5.1203 62.1182 23.2788 35.3969 82.4833 18.1087 29.1070 5.7754 5.8534
temp: 298.150 k
press: 1.00000 atm
elementType: 8 8 6 6 6 6 6 6 6 6 6 6 1 1 1 1 1 1 1 1 1 1 1 1 1 1 1 1
symmnumber: 1
zpe: 632329.3 jmol-1
zpe.correction: 0.240842 hartree
zpe.thermalcorrener: 0.253314 hartree
zpe.thermalcorrenthalpy: 0.254259 hartree
zpe.thermalcorrgfe: 0.201532 hartree
zpe.sumelectzpe: -540.160362 hartree
zpe.sumelectthermal: -540.147890 hartree
zpe.sumelectthermalent: -540.146945 hartree
zpe.sumelectthermalfe: -540.199672 hartree
dipole: -1.1828 1.8790 0.1494
dipole: 2.2253
quadrupole: -66.8781 -76.1335 -72.8197
quadrupole: 6.7733 2.3505 0.0639
quadrupole: 5.0657 -4.1898 -0.8759 6.7733 2.3505 0.0639
hfenergy: -540.4012039 hartree
pointgroup: C01 [X(C10H16O2)]
dipole: -0.5054337 -0.690496 0.1851141 debye
polarizability: 146.5299239|0.60888|102.4640346|-3.6004855|-5.8729531|87.6261454 unknown
InChI: InChI=1S/C10H16O2/c1-8(2)10(11)12-9-6-4-3-5-7-9/h9H,1,3-7H2,2H3
charge 0 multiplicity 1
28 atoms
O  0.255869 -0.030902 0.338308
O  1.748473 1.629242 -0.350069
C  -0.884572 0.952731 0.225385
C  -1.378977 0.989751 -1.234878
C  -1.960208 0.459792 1.20598
C  -2.017151 -0.35009 -1.671186
C  -2.595824 -0.878479 0.757298
C  -3.133448 -0.786426 -0.691574
C  1.528895 0.445013 0.012963
C  2.562805 -0.635761 0.166543
C  2.117867 -2.016593 0.602081
C  3.856233 -0.303778 -0.100678
H  -0.483661 1.941109 0.516901
H  -0.543095 1.274218 -1.899009
H  -2.134466 1.799482 -1.304619
H  -2.744123 1.242698 1.259559
H  -1.521276 0.368157 2.216759
H  -1.234303 -1.133494 -1.702133
H  -2.419185 -0.254284 -2.697934
H  -3.408737 -1.159052 1.454083
H  -1.829753 -1.676323 0.812218
H  -3.963666 -0.050046 -0.72991
H  -3.555648 -1.760941 -1.003986
H  1.608145 -1.977994 1.58136
H  1.389997 -2.441697 -0.112539
H  2.980485 -2.700183 0.676928
H  4.664446 -1.037503 -0.010084
H  4.114479 0.714053 -0.412865
