program: Orca
programVersion: 5.0.2
elementType: O O O O N N N C C C C C C C C C C C C C C C H H H H H H H H H H H H H H H H H H H
charge: 0
multiplicity: 1
keywords: wb97x-d3
keywords: def2-TZVPP
keywords: def2/J RIJCOSX
keywords: DEFGRID2
keywords: scfconv7
keywords: smallprint printgap noloewdin
keywords: NOSOSCF
formula: C15H19N3O4
InChI: InChI=1/C15H19N3O4/c1-8(2)15(3)14(21)17-12(18-15)11-10(13(19)20)5-9(6-16-11)7-22-4/h5-6,8,17,19H,7H2,1-4H3
41 atoms
O  3.55535 2.407518 0.571261
O  -5.394058 1.23354 0.383144
O  0.046763 -2.772669 0.313611
O  -0.380116 -2.590996 -1.876164
N  1.669628 -0.378905 -0.547506
N  1.401112 1.61954 0.417774
N  -1.324339 1.347628 0.280991
C  3.003085 0.186962 -0.376637
C  3.827906 -0.752627 0.540135
C  2.754263 1.551665 0.266613
C  3.6465 0.376872 -1.747799
C  5.298848 -0.366247 0.645949
C  3.213817 -0.887801 1.930199
C  0.839478 0.462407 -0.081107
C  -0.615402 0.280729 -0.053545
C  -1.208449 -0.935324 -0.389212
C  -2.590582 -0.996535 -0.400783
C  -3.340953 0.119611 -0.053996
C  -2.646725 1.27366 0.289778
C  -0.443768 -2.16726 -0.752318
C  -4.837279 0.034668 -0.068356
C  -6.800621 1.217389 0.36607
H  3.774466 -1.731452 0.051495
H  2.989273 0.939537 -2.411773
H  4.587454 0.919952 -1.674082
H  3.843167 -0.59164 -2.208845
H  5.817253 -1.086841 1.280651
H  5.803285 -0.373849 -0.319975
H  5.440625 0.617669 1.092868
H  3.756174 -1.641268 2.503469
H  2.170884 -1.203925 1.896739
H  3.271017 0.044459 2.49696
H  0.88173 2.398267 0.798647
H  -3.089375 -1.922445 -0.665444
H  -3.168543 2.175711 0.581195
H  -5.170016 -0.198345 -1.091047
H  -5.154158 -0.81279 0.557281
H  0.53292 -3.572142 0.05458
H  -7.14929 2.181457 0.734794
H  -7.211149 0.431562 1.010977
H  -7.197662 1.069076 -0.645007
elementType: O N C H
totalener: -1048.35257750 hartree
nucrepener: 1844.58479935 hartree
electener: -2892.93737686 hartree
oneelecener: -5092.81024267 hartree
twoeener: 2199.87286582 hartree
cpcmener: -0.03997001 hartree
kineticenergy: 1043.91325370 hartree
xcener: -99.370423522846 hartree
chargesum: -0.0000000
charge: -0.455291 -0.361592 -0.280004 -0.414741 -0.366247 -0.088992 -0.398044 0.378244 0.024204 0.169233 -0.324708 -0.305062 -0.303924 0.245387 0.147408 -0.075066 -0.079952 0.013451 -0.016390 0.382244 0.083876 -0.118060 0.046981 0.113236 0.101151 0.110734 0.095356 0.094892 0.089618 0.099538 0.091424 0.092519 0.176513 0.141720 0.128571 0.098565 0.097084 0.261758 0.114655 0.094305 0.095406
qa: -0.4553 -0.3616 -0.2800 -0.4147 -0.3662 -0.0890 -0.3980 0.3782 0.0242 0.1692 -0.3247 -0.3051 -0.3039 0.2454 0.1474 -0.0751 -0.0800 0.0135 -0.0164 0.3822 0.0839 -0.1181 0.0470 0.1132 0.1012 0.1107 0.0954 0.0949 0.0896 0.0995 0.0914 0.0925 0.1765 0.1417 0.1286 0.0986 0.0971 0.2618 0.1147 0.0943 0.0954
va: 2.0644 1.9479 2.1971 2.0795 2.9958 3.2349 3.0359 3.5994 3.8661 4.2903 3.9668 3.9516 3.9346 4.2545 3.8252 3.8303 4.0122 3.6977 4.0976 4.3668 3.9226 3.9086 1.0276 1.0034 1.0042 1.0024 1.0040 1.0001 1.0148 1.0038 1.0142 1.0043 1.0311 1.0086 1.0262 0.9867 0.9881 0.9898 0.9927 0.9892 0.9898
dispcorr: -0.020102980 hartree
energy: -1048.372680484464
dipole: 4.66655 -7.47378 -2.80723 -2.16912 0.72685 -1.44228 3.91163 -3.33017 0.58146
magnitude: 3.20917 au
magnitude: 8.15707 debye
