program: Orca
programVersion: 5.0.2
elementType: O O O O N N N C C C C C C C C C C C C C C C H H H H H H H H H H H H H H H H H H H
charge: 0
multiplicity: 1
keywords: wb97x-d3
keywords: def2-TZVPP
keywords: def2/J RIJCOSX
keywords: DEFGRID2
keywords: scfconv7
keywords: smallprint printgap noloewdin
keywords: NOSOSCF
formula: C15H19N3O4
InChI: InChI=1/C15H19N3O4/c1-8(2)15(3)14(21)17-12(18-15)11-10(13(19)20)5-9(6-16-11)7-22-4/h5-6,8,17,19H,7H2,1-4H3
41 atoms
O  3.563805 2.544067 0.081522
O  -5.507187 1.203716 0.130201
O  -0.347246 -2.461725 -1.564361
O  -0.043361 -2.855279 0.618886
N  1.636504 -0.389198 -0.392821
N  1.393203 1.77121 0.1333
N  -1.329612 1.449853 0.309615
C  2.969398 0.192027 -0.38651
C  3.853153 -0.491472 0.683907
C  2.742675 1.660886 -0.027314
C  3.582532 0.117359 -1.7835
C  3.304087 -0.304634 2.095721
C  4.051056 -1.974707 0.395238
C  0.820397 0.535091 -0.087207
C  -0.627128 0.353416 0.054967
C  -1.213877 -0.903236 -0.058491
C  -2.588614 -0.991112 0.10005
C  -3.329212 0.148645 0.370883
C  -2.638311 1.353419 0.463641
C  -0.439167 -2.163756 -0.2824
C  -4.8168 0.078163 0.597708
C  -5.580147 1.269425 -1.276194
H  4.827293 0.00614 0.628809
H  4.598715 0.512419 -1.776631
H  3.615968 -0.911421 -2.137583
H  2.998615 0.694368 -2.501992
H  3.230227 0.744451 2.38786
H  2.318835 -0.760086 2.211599
H  3.966595 -0.784167 2.817978
H  4.509275 -2.158875 -0.576421
H  3.105383 -2.517594 0.431779
H  4.710441 -2.413037 1.146214
H  0.884385 2.609853 0.375768
H  -3.085199 -1.951109 0.012876
H  -3.164914 2.278211 0.669647
H  -5.207878 -0.84702 0.153237
H  -5.008619 0.017443 1.672809
H  0.138637 -3.294225 -1.684287
H  -4.598125 1.38604 -1.747676
H  -6.184978 2.137828 -1.53576
H  -6.055967 0.377436 -1.700186
elementType: O N C H
totalener: -1048.35278178 hartree
nucrepener: 1866.21007554 hartree
electener: -2914.56285731 hartree
oneelecener: -5135.80586454 hartree
twoeener: 2221.24300723 hartree
cpcmener: -0.04057228 hartree
kineticenergy: 1043.91904550 hartree
xcener: -99.371359746270 hartree
chargesum: -0.0000000
charge: -0.452305 -0.377197 -0.279213 -0.422257 -0.389356 -0.089377 -0.399372 0.348067 0.061555 0.176268 -0.331820 -0.312105 -0.308795 0.254125 0.195932 -0.103797 -0.045218 -0.058759 -0.000093 0.398752 0.079830 -0.111925 0.049765 0.106975 0.106044 0.114675 0.099027 0.084810 0.100866 0.094215 0.081436 0.096920 0.177774 0.140765 0.125412 0.102367 0.111346 0.261047 0.096499 0.118261 0.098855
qa: -0.4523 -0.3772 -0.2792 -0.4223 -0.3894 -0.0894 -0.3994 0.3481 0.0616 0.1763 -0.3318 -0.3121 -0.3088 0.2541 0.1959 -0.1038 -0.0452 -0.0588 -0.0001 0.3988 0.0798 -0.1119 0.0498 0.1070 0.1060 0.1147 0.0990 0.0848 0.1009 0.0942 0.0814 0.0969 0.1778 0.1408 0.1254 0.1024 0.1113 0.2610 0.0965 0.1183 0.0989
va: 2.0797 1.9262 2.2194 2.0690 3.0177 3.2244 3.0326 3.6171 3.7983 4.2877 3.9732 3.9434 3.9556 4.2807 3.7434 3.8438 3.9748 3.6425 4.0886 4.3619 3.8783 3.8982 1.0292 1.0082 1.0023 1.0000 1.0074 1.0104 1.0043 1.0004 1.0132 1.0051 1.0300 1.0063 1.0226 0.9987 0.9897 0.9913 0.9830 0.9927 0.9924
dispcorr: -0.020959200 hartree
energy: -1048.373740977265
dipole: 5.62626 -7.94412 -2.31785 -4.35627 3.20473 -1.15154 -0.98207 -0.11462 -1.09670
magnitude: 2.81091 au
magnitude: 7.14478 debye
