program: Orca
programVersion: 5.0.2
elementType: O O O O N N N C C C C C C C C C C C C C C C H H H H H H H H H H H H H H H H H H H
charge: 0
multiplicity: 1
keywords: wb97x-d3
keywords: def2-TZVPP
keywords: def2/J RIJCOSX
keywords: DEFGRID2
keywords: scfconv7
keywords: smallprint printgap noloewdin
keywords: NOSOSCF
formula: C15H19N3O4
InChI: InChI=1/C15H19N3O4/c1-8(2)15(3)14(21)17-12(18-15)11-10(13(19)20)5-9(6-16-11)7-22-4/h5-6,8,17,19H,7H2,1-4H3
41 atoms
O  3.535871 2.356656 0.636535
O  -5.515209 1.101067 0.438753
O  -0.087545 -2.635995 0.3039
O  -0.520587 -2.635342 -1.893642
N  1.617535 -0.394919 -0.519065
N  1.361935 1.641964 0.372219
N  -1.345551 1.473727 0.07099
C  2.956999 0.128138 -0.282444
C  3.688943 -0.807439 0.711698
C  2.729679 1.526986 0.307646
C  3.688257 0.240121 -1.618284
C  5.1577 -0.446198 0.911707
C  2.973824 -0.89204 2.05787
C  0.795329 0.489006 -0.127294
C  -0.66535 0.365287 -0.195771
C  -1.285902 -0.826088 -0.561646
C  -2.665303 -0.812145 -0.702589
C  -3.383626 0.34217 -0.438851
C  -2.661141 1.461455 -0.03447
C  -0.561624 -2.107998 -0.820365
C  -4.882834 0.401857 -0.59056
C  -5.489223 0.432222 1.672882
H  3.64139 -1.797363 0.244289
H  3.884558 -0.753857 -2.020589
H  3.084221 0.781094 -2.346324
H  4.632874 0.769009 -1.506368
H  5.728399 -0.499195 -0.014564
H  5.278445 0.554856 1.323652
H  5.615466 -1.149207 1.609367
H  3.012519 0.056801 2.597059
H  3.459224 -1.635811 2.691219
H  1.930484 -1.187814 1.952427
H  0.841148 2.44748 0.679552
H  -3.182662 -1.71597 -1.003649
H  -3.173109 2.384664 0.212994
H  -5.132713 0.925213 -1.517564
H  -5.277575 -0.620993 -0.688786
H  0.415567 -3.430547 0.08119
H  -5.964176 -0.554964 1.61239
H  -6.046642 1.038034 2.38534
H  -4.473512 0.294345 2.060713
totalener: -1048.32242924 hartree
nucrepener: 1861.05597270 hartree
electener: -2909.37840195 hartree
oneelecener: -5125.00124876 hartree
twoeener: 2215.62284681 hartree
kineticenergy: 1043.99579582 hartree
xcener: -99.373104062276 hartree
chargesum: -0.0000000
charge: -0.341179 -0.314447 -0.250612 -0.316013 -0.334218 -0.108531 -0.364291 0.353925 0.002125 0.119875 -0.303963 -0.278817 -0.294388 0.255524 0.126803 -0.053398 -0.024889 -0.098946 -0.002816 0.321918 0.063874 -0.114871 0.038697 0.103687 0.100703 0.102330 0.080996 0.105299 0.081166 0.092054 0.088192 0.092698 0.156764 0.112536 0.121883 0.101365 0.081171 0.207363 0.084634 0.114954 0.090845
qa: -0.3412 -0.3144 -0.2506 -0.3160 -0.3342 -0.1085 -0.3643 0.3539 0.0021 0.1199 -0.3040 -0.2788 -0.2944 0.2555 0.1268 -0.0534 -0.0249 -0.0989 -0.0028 0.3219 0.0639 -0.1149 0.0387 0.1037 0.1007 0.1023 0.0810 0.1053 0.0812 0.0921 0.0882 0.0927 0.1568 0.1125 0.1219 0.1014 0.0812 0.2074 0.0846 0.1150 0.0908
va: 2.1775 1.9775 2.2004 2.1800 2.9733 3.2116 3.0425 3.6470 3.9117 4.3151 3.9641 3.9504 3.9374 4.1803 3.8204 3.8816 3.9527 3.6734 4.1061 4.3858 3.9149 3.9247 1.0255 1.0042 1.0093 1.0049 1.0045 1.0141 1.0062 1.0067 1.0057 1.0139 1.0459 1.0171 1.0214 0.9894 1.0004 1.0381 0.9933 0.9952 0.9815
dispcorr: -0.020900719 hartree
energy: -1048.343329963453
dipole: 8.05072 -9.50372 -1.45300 -3.78877 2.95122 -0.83755 7.67532 -7.15453 0.52079
magnitude: 1.75611 au
magnitude: 4.46368 debye
