program: Orca
programVersion: 5.0.2
elementType: O O O O N N N C C C C C C C C C C C C C C C H H H H H H H H H H H H H H H H H H H
charge: 0
multiplicity: 1
keywords: wb97x-d3
keywords: def2-TZVPP
keywords: def2/J RIJCOSX
keywords: DEFGRID2
keywords: scfconv7
keywords: smallprint printgap noloewdin
keywords: NOSOSCF
formula: C15H19N3O4
InChI: InChI=1/C15H19N3O4/c1-8(2)15(3)14(21)17-12(18-15)11-10(13(19)20)5-9(6-16-11)7-22-4/h5-6,8,17,19H,7H2,1-4H3
41 atoms
O  3.713154 2.312155 0.127242
O  -5.561902 -0.174052 -0.331055
O  -0.11915 -2.422007 1.046678
O  -0.894433 -2.706155 -1.035311
N  1.515428 -0.42842 -0.376319
N  1.495151 1.709955 0.282103
N  -1.235891 1.682313 0.373766
C  2.894935 0.03855 -0.431906
C  3.758538 -0.83947 0.505503
C  2.829298 1.502444 0.026385
C  3.373275 -0.017219 -1.882069
C  5.251684 -0.541433 0.413158
C  3.290375 -0.763624 1.956398
C  0.805931 0.544149 0.025386
C  -0.651619 0.506116 0.195292
C  -1.372371 -0.685142 0.113566
C  -2.753081 -0.610887 0.180187
C  -3.373445 0.617671 0.36139
C  -2.553643 1.733735 0.45741
C  -0.746297 -2.031598 -0.058593
C  -4.872591 0.728696 0.477894
C  -5.474413 0.112847 -1.70361
H  3.59197 -1.863424 0.15287
H  3.442032 -1.053511 -2.21251
H  2.672893 0.496974 -2.539895
H  4.346882 0.456111 -1.993862
H  5.799305 -1.209096 1.079782
H  5.646106 -0.698393 -0.589987
H  5.480455 0.481667 0.70838
H  2.233682 -1.006445 2.062162
H  3.462588 0.225874 2.385087
H  3.85013 -1.474137 2.565998
H  1.067205 2.576736 0.564831
H  -3.349328 -1.511243 0.094334
H  -2.985092 2.719886 0.59895
H  -5.170073 0.508104 1.50689
H  -5.175573 1.767741 0.277876
H  0.309959 -3.270493 0.871782
H  -6.091538 -0.613711 -2.228802
H  -4.451906 0.036447 -2.089031
H  -5.850067 1.117352 -1.934271
totalener: -1048.32299923 hartree
nucrepener: 1863.63764117 hartree
electener: -2911.96064039 hartree
oneelecener: -5130.22594811 hartree
twoeener: 2218.26530772 hartree
kineticenergy: 1043.99778086 hartree
xcener: -99.374000703536 hartree
chargesum: -0.0000000
charge: -0.341584 -0.317483 -0.251814 -0.315831 -0.335068 -0.108986 -0.370174 0.351594 0.005110 0.121409 -0.306597 -0.278376 -0.294384 0.260973 0.112420 -0.018083 -0.090499 -0.059342 0.000650 0.322445 0.066302 -0.115734 0.039352 0.104722 0.100730 0.103011 0.081414 0.081235 0.104127 0.092817 0.091299 0.088048 0.156058 0.134183 0.100330 0.100024 0.081688 0.207839 0.114653 0.096176 0.085344
qa: -0.3416 -0.3175 -0.2518 -0.3158 -0.3351 -0.1090 -0.3702 0.3516 0.0051 0.1214 -0.3066 -0.2784 -0.2944 0.2610 0.1124 -0.0181 -0.0905 -0.0593 0.0006 0.3224 0.0663 -0.1157 0.0394 0.1047 0.1007 0.1030 0.0814 0.0812 0.1041 0.0928 0.0913 0.0880 0.1561 0.1342 0.1003 0.1000 0.0817 0.2078 0.1147 0.0962 0.0853
va: 2.1774 1.9770 2.2011 2.1817 2.9725 3.2123 3.0510 3.6493 3.9064 4.3152 3.9668 3.9503 3.9365 4.1840 3.8276 3.8401 3.9682 3.6360 4.1232 4.3866 3.9154 3.9191 1.0256 1.0045 1.0087 1.0050 1.0060 1.0046 1.0140 1.0145 1.0071 1.0054 1.0459 1.0302 1.0124 0.9897 0.9985 1.0374 0.9963 0.9811 0.9928
dispcorr: -0.020930869 hartree
energy: -1048.343930095153
dipole: 8.67054 -10.04301 -1.37247 -1.89860 1.89868 0.00008 -1.13092 1.53789 0.40697
magnitude: 1.43154 au
magnitude: 3.63868 debye
