program: Orca
programVersion: 5.0.2
elementType: O O O N N C C C C C C C C C C C C C C C C H H H H H H H H H H H H H H H H H H H H
charge: 0
multiplicity: 1
keywords: wb97x-d3
keywords: def2-TZVPP
keywords: def2/J RIJCOSX
keywords: DEFGRID2
keywords: scfconv7
keywords: smallprint printgap noloewdin
keywords: NOSOSCF
formula: C16H20N2O3
InChI: InChI=1/C16H20N2O3/c1-9(2)16(4)15(20)17-13(18-16)12-8-10(3)6-7-11(12)14(19)21-5/h6-9,17H,1-5H3
41 atoms
O  -3.040391 0.055858 2.189974
O  1.293381 -2.255009 0.177731
O  2.21538 -2.077351 -1.851104
N  -0.899524 -0.323599 -0.61789
N  -0.902536 0.489681 1.467533
C  -2.243569 -0.523275 -0.082815
C  -3.253135 0.25368 -0.963556
C  -2.17756 0.033632 1.334724
C  -2.544025 -2.018084 -0.021058
C  -4.713266 -0.037385 -0.635305
C  -3.001052 1.758424 -0.931413
C  -0.211197 0.236375 0.295559
C  1.189589 0.656172 0.156858
C  2.144781 -0.171572 -0.434269
C  1.538453 1.94902 0.53382
C  2.820245 2.445598 0.325132
C  3.422012 0.326771 -0.667364
C  3.756073 1.614023 -0.285751
C  1.87666 -1.5864 -0.799837
C  3.1795 3.844185 0.719293
C  0.932316 -3.614934 -0.077514
H  -3.066136 -0.102521 -1.981461
H  -1.767537 -2.547765 0.53134
H  -3.493731 -2.213537 0.474142
H  -2.59124 -2.434138 -1.027309
H  -5.354892 0.519632 -1.318982
H  -4.967035 -1.090635 -0.747452
H  -4.979937 0.268574 0.376327
H  -3.629015 2.257325 -1.670483
H  -1.967108 2.016399 -1.161119
H  -3.249795 2.189773 0.041018
H  -0.508679 0.895484 2.306243
H  0.790678 2.596956 0.975744
H  4.172003 -0.30536 -1.12475
H  4.76124 1.976258 -0.462819
H  4.10732 3.86751 1.29118
H  3.332049 4.469115 -0.162231
H  2.397835 4.3045 1.321308
H  0.229973 -3.688752 -0.907412
H  0.456233 -3.972575 0.830102
H  1.810403 -4.225343 -0.286355
elementType: O N C H
totalener: -957.07829414 hartree
nucrepener: 1745.80500443 hartree
electener: -2702.88329857 hartree
oneelecener: -4769.88620502 hartree
twoeener: 2067.00290645 hartree
cpcmener: -0.04421463 hartree
kineticenergy: 952.89728457 hartree
xcener: -92.379932842947 hartree
chargesum: -0.0000000
charge: -0.493851 -0.271099 -0.476975 -0.409683 -0.087027 0.447613 0.027940 0.185071 -0.368163 -0.313303 -0.307622 0.344000 -0.097046 -0.062512 -0.172315 -0.024557 -0.106822 -0.149883 0.415184 -0.218392 -0.154758 0.046150 0.121677 0.112028 0.115694 0.098337 0.096646 0.086104 0.102430 0.096462 0.091151 0.187574 0.136765 0.151380 0.149104 0.104524 0.108025 0.095348 0.124541 0.135836 0.134423
qa: -0.4939 -0.2711 -0.4770 -0.4097 -0.0870 0.4476 0.0279 0.1851 -0.3682 -0.3133 -0.3076 0.3440 -0.0970 -0.0625 -0.1723 -0.0246 -0.1068 -0.1499 0.4152 -0.2184 -0.1548 0.0461 0.1217 0.1120 0.1157 0.0983 0.0966 0.0861 0.1024 0.0965 0.0912 0.1876 0.1368 0.1514 0.1491 0.1045 0.1080 0.0953 0.1245 0.1358 0.1344
va: 2.0186 2.1153 2.0195 3.0188 3.2593 3.5439 3.8689 4.2803 3.9772 3.9516 3.9278 3.8566 3.7826 3.7652 3.9325 3.8313 3.9258 3.9458 4.1832 3.9084 3.8493 1.0292 0.9949 1.0055 1.0025 1.0036 0.9999 1.0148 1.0035 1.0115 1.0034 1.0050 1.0191 1.0083 0.9953 0.9968 0.9943 1.0056 0.9912 0.9908 0.9971
dispcorr: -0.021283307 hartree
energy: -957.099577452140
dipole: -12.76601 14.11357 1.34756 4.37226 -3.22871 1.14355 -2.45976 3.49901 1.03925
magnitude: 2.05029 au
magnitude: 5.21141 debye
