program: Orca
programVersion: 5.0.2
elementType: O O O N N C C C C C C C C C C C C C C C C H H H H H H H H H H H H H H H H H H H H
charge: 0
multiplicity: 1
keywords: wb97x-d3
keywords: def2-TZVPP
keywords: def2/J RIJCOSX
keywords: DEFGRID2
keywords: scfconv7
keywords: smallprint printgap noloewdin
keywords: NOSOSCF
formula: C16H20N2O3
InChI: InChI=1/C16H20N2O3/c1-9(2)16(4)15(20)17-13(18-16)12-8-10(3)6-7-11(12)14(19)21-5/h6-9,17H,1-5H3
41 atoms
O  -3.307484 0.767988 1.833297
O  2.096373 -2.381036 -0.953308
O  1.211593 -2.168942 1.088864
N  -0.871244 -0.464511 -0.434397
N  -1.1012 1.009384 1.233448
C  -2.260533 -0.533863 0.005919
C  -3.186608 -0.177692 -1.181137
C  -2.353295 0.483945 1.137073
C  -2.528051 -1.928161 0.568611
C  -4.663488 -0.439816 -0.910065
C  -2.984092 1.25859 -1.653982
C  -0.285068 0.395214 0.299739
C  1.135395 0.747356 0.189785
C  2.091451 -0.249007 -0.009776
C  1.520641 2.083275 0.197689
C  2.847215 2.453551 0.003053
C  3.415673 0.113568 -0.223183
C  3.786823 1.447588 -0.209418
C  1.734358 -1.689145 0.111335
C  3.25866 3.892827 0.022617
C  1.835421 -3.788643 -0.940813
H  -2.875052 -0.849085 -1.987481
H  -3.507023 -1.986766 1.041407
H  -2.488529 -2.669221 -0.230061
H  -1.77932 -2.193426 1.315573
H  -5.053471 0.17777 -0.100743
H  -5.242726 -0.20371 -1.803999
H  -4.863795 -1.482644 -0.666227
H  -3.353507 1.981955 -0.923505
H  -3.537885 1.428705 -2.578013
H  -1.938123 1.488776 -1.85871
H  -0.805624 1.694795 1.915929
H  0.773091 2.856139 0.332475
H  4.170505 -0.647058 -0.374259
H  4.826026 1.709314 -0.366042
H  3.847539 4.115783 0.914052
H  3.87887 4.138889 -0.839379
H  2.39613 4.557026 0.020885
H  2.211132 -4.168969 -1.885712
H  0.766243 -3.987367 -0.870852
H  2.354021 -4.283045 -0.120172
elementType: O N C H
totalener: -957.07772705 hartree
nucrepener: 1735.44394964 hartree
electener: -2692.52167670 hartree
oneelecener: -4749.86457371 hartree
twoeener: 2057.34289701 hartree
cpcmener: -0.04344657 hartree
kineticenergy: 952.89488444 hartree
xcener: -92.378925146914 hartree
chargesum: 0.0000000
charge: -0.493802 -0.277341 -0.475853 -0.408458 -0.090911 0.435977 0.030483 0.189590 -0.351116 -0.309037 -0.307326 0.348168 -0.090145 -0.084132 -0.159788 -0.032792 -0.119965 -0.141435 0.436363 -0.221551 -0.129057 0.045314 0.106329 0.113569 0.113624 0.086427 0.097615 0.096074 0.089629 0.101765 0.097527 0.187980 0.136734 0.154078 0.148363 0.108056 0.104618 0.095708 0.130523 0.118787 0.119406
qa: -0.4938 -0.2773 -0.4759 -0.4085 -0.0909 0.4360 0.0305 0.1896 -0.3511 -0.3090 -0.3073 0.3482 -0.0901 -0.0841 -0.1598 -0.0328 -0.1200 -0.1414 0.4364 -0.2216 -0.1291 0.0453 0.1063 0.1136 0.1136 0.0864 0.0976 0.0961 0.0896 0.1018 0.0975 0.1880 0.1367 0.1541 0.1484 0.1081 0.1046 0.0957 0.1305 0.1188 0.1194
va: 2.0169 2.1272 2.0142 3.0142 3.2644 3.5550 3.8607 4.2783 3.9760 3.9500 3.9292 3.8702 3.7343 3.7709 3.9223 3.8394 3.9447 3.9252 4.1674 3.9095 3.8661 1.0301 1.0053 1.0009 1.0072 1.0148 1.0039 1.0000 1.0041 1.0033 1.0110 1.0051 1.0184 1.0054 0.9953 0.9940 0.9968 1.0054 0.9953 0.9919 0.9935
dispcorr: -0.020590328 hartree
energy: -957.098317381643
dipole: -9.76276 12.10489 2.34212 1.67163 -0.65920 1.01243 -8.62854 7.54093 -1.08761
magnitude: 2.77370 au
magnitude: 7.05020 debye
