program: Orca
programVersion: 5.0.2
elementType: O O O N N C C C C C C C C C C C C C C C C H H H H H H H H H H H H H H H H H H H H
charge: 0
multiplicity: 1
keywords: wb97x-d3
keywords: def2-TZVPP
keywords: def2/J RIJCOSX
keywords: DEFGRID2
keywords: scfconv7
keywords: smallprint printgap noloewdin
keywords: NOSOSCF
formula: C16H20N2O3
InChI: InChI=1/C16H20N2O3/c1-9(2)16(4)15(20)17-13(18-16)12-8-10(3)6-7-11(12)14(19)21-5/h6-9,17H,1-5H3
41 atoms
O  -3.167464 -0.059108 2.084087
O  2.442301 -2.33072 -1.175228
O  1.005381 -2.271805 0.534544
N  -0.976385 -0.16134 -0.71056
N  -1.007597 0.408644 1.453992
C  -2.328908 -0.414286 -0.219943
C  -3.334857 0.433969 -1.033261
C  -2.286541 -0.008107 1.248726
C  -2.612033 -1.912166 -0.313449
C  -4.794135 0.07526 -0.775794
C  -3.117625 1.930745 -0.83303
C  -0.297678 0.273026 0.274511
C  1.12457 0.654208 0.218648
C  2.109607 -0.273411 -0.121908
C  1.469073 1.981941 0.43932
C  2.786208 2.414531 0.324348
C  3.425438 0.158071 -0.263187
C  3.756303 1.482178 -0.036844
C  1.778338 -1.717388 -0.212427
C  3.157117 3.842769 0.575186
C  2.243496 -3.740352 -1.317119
H  -3.117317 0.196084 -2.079337
H  -2.668092 -2.218899 -1.358103
H  -1.820504 -2.487558 0.167105
H  -3.552346 -2.170558 0.170689
H  -5.434059 0.684478 -1.415817
H  -5.013854 -0.966993 -1.004694
H  -5.094115 0.266161 0.254756
H  -3.391846 2.249622 0.175226
H  -3.743375 2.494282 -1.526068
H  -2.085221 2.232324 -1.0133
H  -0.624404 0.724343 2.334959
H  0.695275 2.698323 0.689138
H  4.205871 -0.545738 -0.519039
H  4.788615 1.794559 -0.135128
H  3.609217 4.292217 -0.309925
H  2.290383 4.440543 0.851571
H  3.889212 3.918989 1.380199
H  2.897483 -4.052487 -2.125688
H  1.210598 -3.965879 -1.580918
H  2.513723 -4.274915 -0.407085
elementType: O N C H
totalener: -957.07833235 hartree
nucrepener: 1730.41951334 hartree
electener: -2687.49784569 hartree
oneelecener: -4739.88948202 hartree
twoeener: 2052.39163632 hartree
cpcmener: -0.04221548 hartree
kineticenergy: 952.88918312 hartree
xcener: -92.377315572487 hartree
chargesum: 0.0000000
charge: -0.494491 -0.279319 -0.479591 -0.388808 -0.071073 0.439994 0.030185 0.184683 -0.346628 -0.309098 -0.305422 0.269532 -0.080823 -0.056233 -0.160461 -0.027569 -0.131211 -0.142462 0.442336 -0.219098 -0.126956 0.043227 0.112394 0.112392 0.104306 0.097594 0.096075 0.086171 0.090727 0.101764 0.095542 0.188076 0.143212 0.154223 0.149539 0.106690 0.094682 0.106386 0.129968 0.119733 0.119813
qa: -0.4945 -0.2793 -0.4796 -0.3888 -0.0711 0.4400 0.0302 0.1847 -0.3466 -0.3091 -0.3054 0.2695 -0.0808 -0.0562 -0.1605 -0.0276 -0.1312 -0.1425 0.4423 -0.2191 -0.1270 0.0432 0.1124 0.1124 0.1043 0.0976 0.0961 0.0862 0.0907 0.1018 0.0955 0.1881 0.1432 0.1542 0.1495 0.1067 0.0947 0.1064 0.1300 0.1197 0.1198
va: 2.0171 2.1357 2.0122 3.0294 3.2365 3.5433 3.8670 4.2848 3.9821 3.9495 3.9257 3.9147 3.7568 3.7514 3.9128 3.8167 3.9654 3.9275 4.1376 3.9088 3.8634 1.0301 1.0014 1.0099 1.0046 1.0038 1.0002 1.0150 1.0041 1.0034 1.0127 1.0042 1.0127 1.0107 0.9949 0.9954 1.0058 0.9953 0.9953 0.9919 0.9937
dispcorr: -0.020516191 hartree
energy: -957.098848543855
dipole: -10.01071 12.66316 2.65245 5.14396 -4.02037 1.12360 -7.05789 6.37477 -0.68312
magnitude: 2.96051 au
magnitude: 7.52501 debye
