program: Orca
programVersion: 5.0.2
elementType: O O O N N C C C C C C C C C C C C C C C C H H H H H H H H H H H H H H H H H H H H
charge: 0
multiplicity: 1
keywords: wb97x-d3
keywords: def2-TZVPP
keywords: def2/J RIJCOSX
keywords: DEFGRID2
keywords: scfconv7
keywords: smallprint printgap noloewdin
keywords: NOSOSCF
formula: C16H20N2O3
InChI: InChI=1/C16H20N2O3/c1-9(2)16(4)15(20)17-13(18-16)12-8-10(3)6-7-11(12)14(19)21-5/h6-9,17H,1-5H3
41 atoms
O  -3.24905 0.210528 2.183842
O  2.322494 -2.351431 -0.93265
O  1.006935 -2.161706 0.861691
N  -1.02025 -0.264304 -0.535471
N  -1.083919 0.627717 1.516664
C  -2.364356 -0.482941 -0.018828
C  -3.431666 0.193243 -0.906142
C  -2.353717 0.152286 1.370367
C  -2.604546 -1.984627 0.141952
C  -3.220735 1.700718 -1.011634
C  -3.503263 -0.425639 -2.296798
C  -0.363354 0.333533 0.372311
C  1.049809 0.730732 0.251116
C  2.033058 -0.216217 -0.036954
C  1.385526 2.075842 0.336013
C  2.691281 2.507902 0.125162
C  3.337683 0.210109 -0.262289
C  3.659672 1.553647 -0.177217
C  1.714064 -1.666552 0.018691
C  3.042444 3.962054 0.187275
C  2.134087 -3.768127 -0.938757
H  -4.39015 0.019679 -0.404917
H  -3.628668 -2.179735 0.461339
H  -2.431811 -2.503162 -0.79964
H  -1.930823 -2.416172 0.883148
H  -3.229796 2.199205 -0.040221
H  -2.278511 1.943476 -1.506031
H  -4.021182 2.149934 -1.601518
H  -2.558479 -0.319964 -2.831961
H  -4.27317 0.074365 -2.886803
H  -3.760195 -1.48463 -2.272096
H  -0.711621 1.059787 2.351142
H  0.612434 2.806075 0.546295
H  4.116444 -0.509504 -0.478003
H  4.684083 1.864151 -0.343903
H  3.958374 4.126045 0.755557
H  3.211301 4.362803 -0.814308
H  2.248735 4.549305 0.646839
H  2.481977 -4.222782 -0.011147
H  2.726849 -4.144202 -1.76791
H  1.08703 -4.026274 -1.099059
elementType: O N C H
totalener: -957.08250596 hartree
nucrepener: 1736.63691409 hartree
electener: -2693.71942005 hartree
oneelecener: -4752.20532254 hartree
twoeener: 2058.48590249 hartree
cpcmener: -0.03487804 hartree
kineticenergy: 952.89926491 hartree
xcener: -92.376818003588 hartree
chargesum: -0.0000000
charge: -0.455402 -0.276055 -0.450591 -0.416300 -0.088423 0.437307 0.052148 0.165957 -0.360097 -0.306109 -0.313494 0.298610 -0.077428 -0.059535 -0.164048 -0.023907 -0.125279 -0.140860 0.421646 -0.221222 -0.128055 0.047963 0.112527 0.107766 0.113071 0.096758 0.083680 0.101136 0.085447 0.095484 0.095031 0.185141 0.139391 0.150960 0.145397 0.102820 0.108752 0.095218 0.117913 0.128135 0.118548
qa: -0.4554 -0.2761 -0.4506 -0.4163 -0.0884 0.4373 0.0521 0.1660 -0.3601 -0.3061 -0.3135 0.2986 -0.0774 -0.0595 -0.1640 -0.0239 -0.1253 -0.1409 0.4216 -0.2212 -0.1281 0.0480 0.1125 0.1078 0.1131 0.0968 0.0837 0.1011 0.0854 0.0955 0.0950 0.1851 0.1394 0.1510 0.1454 0.1028 0.1088 0.0952 0.1179 0.1281 0.1185
va: 2.0779 2.1329 2.0474 3.0332 3.2182 3.5065 3.8150 4.3020 3.9857 3.9392 3.9457 3.8898 3.7597 3.7531 3.9257 3.8155 3.9648 3.9337 4.1676 3.9093 3.8693 1.0317 1.0081 1.0007 1.0055 1.0070 1.0102 1.0045 1.0156 1.0045 0.9993 1.0065 1.0150 1.0115 0.9964 0.9977 0.9938 1.0049 0.9938 0.9953 0.9919
dispcorr: -0.020478257 hartree
energy: -957.102984218876
dipole: -7.73910 10.15712 2.41802 3.19767 -2.20359 0.99408 -10.61805 9.83140 -0.78665
magnitude: 2.73017 au
magnitude: 6.93953 debye
