program: Orca
programVersion: 5.0.2
elementType: O O O N N C C C C C C C C C C C C C C C C H H H H H H H H H H H H H H H H H H H H
charge: 0
multiplicity: 1
keywords: wb97x-d3
keywords: def2-TZVPP
keywords: def2/J RIJCOSX
keywords: DEFGRID2
keywords: scfconv7
keywords: smallprint printgap noloewdin
keywords: NOSOSCF
formula: C16H20N2O3
InChI: InChI=1/C16H20N2O3/c1-9(2)16(4)15(20)17-13(18-16)12-8-10(3)6-7-11(12)14(19)21-5/h6-9,17H,1-5H3
41 atoms
O  -3.517801 1.493575 1.192487
O  1.74853 -2.372009 -0.445446
O  1.290676 -1.808713 1.66956
N  -0.886277 -0.516973 -0.062452
N  -1.256339 1.52949 0.756198
C  -2.298537 -0.450782 0.27462
C  -3.184862 -0.710256 -0.962244
C  -2.499988 0.969626 0.7982
C  -2.589781 -1.421886 1.420985
C  -2.951468 0.321781 -2.061621
C  -2.996652 -2.117932 -1.515694
C  -0.363782 0.600093 0.249525
C  1.059827 0.904629 0.079536
C  1.994749 -0.130236 0.130085
C  1.481918 2.198428 -0.209797
C  2.818901 2.485731 -0.460343
C  3.329768 0.146068 -0.128379
C  3.735926 1.439415 -0.414674
C  1.613084 -1.512513 0.547504
C  3.258433 3.874872 -0.807171
C  1.434381 -3.738306 -0.171624
H  -4.219682 -0.612171 -0.617163
H  -3.650887 -1.414252 1.671598
H  -2.307983 -2.436968 1.146878
H  -2.025992 -1.15486 2.315879
H  -3.614349 0.126327 -2.905826
H  -3.155165 1.343261 -1.733887
H  -1.927772 0.285203 -2.438228
H  -3.644561 -2.266993 -2.380694
H  -3.251127 -2.891462 -0.791099
H  -1.969017 -2.286128 -1.841225
H  -1.024392 2.450287 1.102638
H  0.756347 3.001449 -0.271086
H  4.065125 -0.64786 -0.087363
H  4.784192 1.635505 -0.605627
H  3.452883 3.964179 -1.878031
H  2.500941 4.613779 -0.549148
H  4.180791 4.141506 -0.290878
H  2.088131 -4.154046 0.594998
H  1.58972 -4.272235 -1.104819
H  0.394538 -3.850067 0.137311
elementType: O N C H
totalener: -957.08254575 hartree
nucrepener: 1747.66347229 hartree
electener: -2704.74601803 hartree
oneelecener: -4774.08316450 hartree
twoeener: 2069.33714647 hartree
cpcmener: -0.03654688 hartree
kineticenergy: 952.90392585 hartree
xcener: -92.379851818587 hartree
chargesum: 0.0000000
charge: -0.454079 -0.272118 -0.443372 -0.436348 -0.108987 0.389743 0.068298 0.175602 -0.351990 -0.308123 -0.315710 0.374803 -0.061380 -0.101412 -0.158929 -0.030163 -0.105434 -0.146492 0.430201 -0.221597 -0.131797 0.047801 0.112530 0.104359 0.117965 0.100074 0.095141 0.085448 0.096599 0.095480 0.084712 0.180782 0.125704 0.150418 0.144139 0.108008 0.094141 0.102223 0.121445 0.129324 0.112989
qa: -0.4541 -0.2721 -0.4434 -0.4363 -0.1090 0.3897 0.0683 0.1756 -0.3520 -0.3081 -0.3157 0.3748 -0.0614 -0.1014 -0.1589 -0.0302 -0.1054 -0.1465 0.4302 -0.2216 -0.1318 0.0478 0.1125 0.1044 0.1180 0.1001 0.0951 0.0854 0.0966 0.0955 0.0847 0.1808 0.1257 0.1504 0.1441 0.1080 0.0941 0.1022 0.1214 0.1293 0.1130
va: 2.0771 2.1169 2.0550 3.0047 3.2614 3.5867 3.7868 4.2931 3.9824 3.9413 3.9525 3.8796 3.7124 3.7974 3.9513 3.8415 3.9353 3.9343 4.2146 3.9122 3.8689 1.0307 1.0090 1.0010 1.0002 1.0044 1.0075 1.0090 1.0053 0.9993 1.0123 1.0107 1.0199 1.0025 0.9966 0.9932 1.0045 0.9981 0.9947 0.9952 0.9920
dispcorr: -0.020870412 hartree
energy: -957.103416159473
dipole: -6.65986 8.62140 1.96154 -4.25568 4.94606 0.69039 -9.76772 8.53103 -1.23668
magnitude: 2.41944 au
magnitude: 6.14972 debye
