program: Gaussian 09
title: 000007560
version: EM64L-G09RevD.01
frameworkgroup: C1[X(C9H12N2O)]
method: RPBEPBE
basis: SDD
operation: Freq
keyword: #p
keyword: freq=noraman
keyword: PBEPBE/SDD
title: #p freq=noraman PBEPBE/SDD
converged: YES YES NO NO
title: Mulliken charges:
elementType: O N N C C C C C C C C C H H H H H H H H H H H H
charge: -0.316146 -0.164866 -0.502770 0.475964 0.301305 -0.444855 -0.340091 -0.630992 -0.669880 -0.200474 -0.213134 -0.261564 0.319145 0.209687 0.310425 0.223491 0.223640 0.289912 0.248387 0.235658 0.235638 0.222227 0.223261 0.226032
chargesum: 0.00000
title: Mulliken charges with hydrogens summed into heavy atoms:
elementType: O N N C C C C C C C C C
charge: -0.316146 -0.164866 -0.183625 0.475964 0.301305 -0.235168 -0.029666 0.106052 0.049803 0.021753 0.010127 -0.035533
polarizability: 1.78746887e+02 2.47082380e+00 1.16223451e+02 5.80992119e-02 1.96674144e-01 5.64728291e+01
1716.lowfreq: -9.8763 -8.3824 -0.0009 -0.0007 -0.0007 3.3679 34.6179 60.5572 83.6262
frequency: 33.6594 60.5249 83.6113 122.7229 129.5474 163.5731 206.6773 253.9658 260.6023 320.0366 381.3795 407.6121 430.4133 501.4426 562.8568 586.5795 616.2456 624.8449 695.6089 703.4443 764.3300 829.4614 837.1554 853.9906 911.4714 967.8540 982.6258 998.3029 1001.9710 1028.5433 1059.3382 1087.2927 1096.1084 1136.0727 1160.8337 1170.4444 1186.4042 1251.7635 1267.5783 1314.5473 1345.4146 1385.2691 1417.9853 1429.7913 1447.8979 1480.8731 1481.6861 1486.8898 1494.2981 1496.6080 1517.5950 1598.1210 1616.6020 1626.3251 2937.3633 2964.0670 3004.8817 3037.6268 3096.6582 3101.0627 3115.3226 3128.8063 3140.3736 3163.2464 3195.2944 3549.9905
redmass: 2.9564 3.7595 2.0551 1.8797 3.9240 1.1771 2.2580 4.3207 3.1852 4.3873 4.5673 2.9471 3.2080 2.2129 1.3651 5.5808 6.3020 5.4620 1.9768 10.9908 1.7134 5.2942 1.2762 6.4691 1.4264 1.3436 5.8246 1.3006 2.7517 2.0112 1.4134 1.5449 1.2314 1.3303 2.4151 1.0545 1.1128 3.6831 2.3647 1.6767 2.3972 5.9101 1.1529 2.3825 1.2028 1.0691 1.0753 2.4034 1.0453 1.1941 1.9582 6.0986 5.2820 4.6728 1.0383 1.0366 1.1017 1.1024 1.0940 1.0886 1.0963 1.0865 1.0932 1.0998 1.0948 1.0752
irintensity: 0.6502 1.6317 6.9523 0.6818 2.5318 0.1841 0.5606 3.9078 5.8776 1.5022 18.7738 0.0140 1.9164 47.7061 26.9988 4.3332 3.8594 0.0733 43.6384 17.0550 95.1240 2.0162 0.0110 2.3226 13.1974 0.2267 6.4477 3.5705 45.0790 0.4223 18.2406 20.4332 0.0260 0.2014 195.1697 2.1914 7.2602 53.8973 34.2624 23.6257 91.6502 110.4958 38.1348 102.3182 40.9926 29.9183 34.3969 77.1404 4.8302 227.4022 318.0543 52.2527 36.9528 269.9399 55.1766 101.4560 41.2599 46.0762 19.4296 19.0551 0.8385 0.5034 35.2084 26.0647 9.4453 9.9302
temp: 298.150 k
press: 1.00000 atm
elementType: 8 7 7 6 6 6 6 6 6 6 6 6 1 1 1 1 1 1 1 1 1 1 1 1
symmnumber: 1
zpe: 516257.3 jmol-1
zpe.correction: 0.196632 hartree
zpe.thermalcorrener: 0.208614 hartree
zpe.thermalcorrenthalpy: 0.209559 hartree
zpe.thermalcorrgfe: 0.157685 hartree
zpe.sumelectzpe: -534.003529 hartree
zpe.sumelectthermal: -533.991547 hartree
zpe.sumelectthermalent: -533.990602 hartree
zpe.sumelectthermalfe: -534.042476 hartree
dipole: 2.3494 4.2241 0.0018
dipole: 4.8335
quadrupole: -56.3294 -67.8574 -76.1725
quadrupole: 6.2135 0.0021 0.0390
quadrupole: 10.4571 -1.0710 -9.3861 6.2135 0.0021 0.0390
hfenergy: -534.2001609 hartree
pointgroup: C01 [X(C9H12N2O1)]
dipole: -0.8907437 1.6801456 -0.0004912 debye
dipolederiv: -0.8173494 0.0771927 0.0008002 -0.0446883 -1.0599606 -0.0010458 0.0030755 -0.0018772 -0.3876925 -1.5410328 0.2602444 0.0007797 0.2716903 -0.6511003 0.0018613 0.0076573 -0.0047308 -0.35767 -2.1084158 -0.117154 0.0005327 -0.4987538 -0.3465936 -0.0026078 0.0018332 -0.0023555 -0.3484129 1.5770981 -0.0869934 0.0012075 -0.3746748 0.0281627 0.0002513 0.0015513 0.0004241 0.1069232 2.5998906 -0.2301573 -0.0046279 0.3748942 1.2972281 0.0008383 -0.0098897 0.0010532 0.2979508 -0.3834217 0.029545 -0.0003039 -0.2209162 0.0457513 -0.0013236 0.0014211 -0.0013372 -0.2247458 -0.3557845 0.0165334 0.0000884 0.3180656 -0.0794672 -0.0003002 -0.0017662 0.0000157 -0.1756219 0.5070716 0.1688857 0.002501 0.4116117 0.0485574 -0.0016016 -0.0003541 -0.000577 0.2716103 0.0119649 0.00381 0.0007382 -0.2368519 0.4679708 -0.0049545 -0.0004445 -0.0038672 0.2853939 0.1321739 -0.0225259 0.0004184 0.0760412 0.128184 -0.0011852 -0.0000437 -0.0011658 -0.142244 0.1539086 0.0032663 0.0001547 -0.0725991 0.1729875 -0.0015294 0.0006481 -0.0013462 -0.1446522 -0.0838209 -0.0315163 0.0003642 -0.042641 -0.1713992 -0.0000957 0.0003452 -0.0002223 -0.1998597 0.1934736 -0.0399152 -0.0008655 -0.0075961 0.0665845 0.0014686 -0.0011697 0.0021447 0.2868623 0.0253919 0.1163041 -0.0006535 0.0929424 -0.0960612 0.0012992 -0.0004595 0.0012376 0.1647919 0.1856929 -0.0598212 0.0002544 -0.0443001 0.0680113 0.000497 0.0004149 0.000248 0.1814544 -0.1265605 -0.0275091 -0.0939688 -0.0047153 0.0994729 0.0707602 -0.1697673 0.0282621 -0.0928021 -0.1269665 -0.029024 0.0937271 -0.0057111 0.1003298 -0.0667117 0.1693726 -0.0247868 -0.0931204 0.210775 0.0805989 0.0008263 -0.0349785 -0.0147788 -0.0018464 0.0004948 -0.0009805 0.1321999 -0.1347599 0.0832461 0.0057306 0.0143121 0.0863106 0.0010255 0.0053913 -0.0007956 0.1240436 0.0972195 -0.0933963 0.0945976 0.0169635 -0.063394 0.056986 0.0534346 0.1087521 -0.0857059 0.0935992 -0.098917 -0.1017428 0.0095067 -0.0567238 -0.0543243 -0.0610509 -0.1006288 -0.0780291 -0.0119599 -0.102666 0.0003293 -0.1238692 -0.051811 0.0008592 0.0003081 0.0008811 0.1565625 0.0456024 0.0653367 -0.0004308 0.0923936 -0.101485 0.0012339 -0.0005599 0.0011989 0.1512371 -0.1437903 0.0346322 -0.0004572 0.0338741 0.0832239 0.0004457 -0.0004425 0.0004532 0.1715266 unknown
polarizability: 178.6222598|-3.7255143|116.3481455|0.0811101|-0.1832947|56.4727622 unknown
InChI: InChI=1S/C9H12N2O/c1-11(2)9(12)10-8-6-4-3-5-7-8/h3-7,10H,1-2H3
charge 0 multiplicity 1
24 atoms
O  -1.471152 -1.630983 -0.003738
N  -2.871578 0.246621 0.002253
N  -0.526715 0.531284 -0.004074
C  0.861876 0.221347 -0.001927
C  -1.609418 -0.367403 -0.001209
C  1.766864 1.320205 -0.006181
C  1.375303 -1.103933 0.004443
C  -4.063809 -0.615381 -0.009242
C  -3.066629 1.703172 0.011348
C  3.15874 1.101492 -0.004007
C  2.772797 -1.304257 0.006818
C  3.674439 -0.215651 0.002699
H  -0.737976 1.529475 -0.0122
H  1.378218 2.347802 -0.011136
H  0.677358 -1.942608 0.006879
H  -4.680556 -0.428272 -0.909509
H  -4.684935 -0.44615 0.891522
H  -3.725549 -1.66268 -0.018297
H  -4.146774 1.917294 0.035727
H  -2.659134 2.190477 -0.898963
H  -2.621286 2.1818 0.907986
H  3.838991 1.960747 -0.007389
H  3.157489 -2.330676 0.011847
H  4.755936 -0.387724 0.004553
