program: Orca
programVersion: 5.0.2
elementType: O O O N N C C C C C C C C C C C C C C C C H H H H H H H H H H H H H H H H H H H H
charge: 0
multiplicity: 1
keywords: wb97x-d3
keywords: def2-TZVPP
keywords: def2/J RIJCOSX
keywords: DEFGRID2
keywords: scfconv7
keywords: smallprint printgap noloewdin
keywords: NOSOSCF
formula: C16H20N2O3
InChI: InChI=1/C16H20N2O3/c1-9(2)16(4)15(20)17-13(18-16)12-8-10(3)6-7-11(12)14(19)21-5/h6-9,17H,1-5H3
41 atoms
O  -3.04473 -1.123586 1.925887
O  2.995688 -2.470621 -0.517117
O  0.827396 -2.351924 -0.013784
N  -1.207882 0.174213 -0.822924
N  -0.933454 -0.414355 1.321543
C  -2.493663 -0.320074 -0.347956
C  -3.584139 0.763081 -0.472127
C  -2.264234 -0.686991 1.121202
C  -2.84649 -1.60408 -1.099821
C  -3.22564 2.021271 0.3149
C  -3.869736 1.119171 -1.927161
C  -0.389545 0.053124 0.136374
C  1.01959 0.508317 0.09079
C  2.11219 -0.351211 -0.060127
C  1.232482 1.875286 0.192121
C  2.510616 2.422206 0.161761
C  3.393628 0.192371 -0.099259
C  3.588969 1.555984 0.019477
C  1.888012 -1.812613 -0.189319
C  2.71161 3.904889 0.246108
C  2.879572 -3.879944 -0.663787
H  -4.489214 0.33298 -0.029871
H  -3.813043 -1.985775 -0.770646
H  -2.882111 -1.422285 -2.17213
H  -2.094808 -2.373434 -0.921272
H  -4.0339 2.750845 0.249958
H  -3.063394 1.821152 1.375016
H  -2.327469 2.492623 -0.088186
H  -2.96519 1.465191 -2.427795
H  -4.61165 1.917175 -1.981546
H  -4.26628 0.276436 -2.492588
H  -0.417218 -0.65878 2.14974
H  0.373865 2.528358 0.293456
H  4.250319 -0.454628 -0.221457
H  4.596425 1.952537 -0.004432
H  3.688195 4.155857 0.658019
H  2.649551 4.358726 -0.7450
H  1.95301 4.379615 0.867218
H  2.569481 -4.356452 0.266712
H  3.868732 -4.233519 -0.941645
H  2.165865 -4.143054 -1.444852
totalener: -957.05757465 hartree
nucrepener: 1729.45687392 hartree
electener: -2686.51444857 hartree
oneelecener: -4737.16737215 hartree
twoeener: 2050.65292358 hartree
kineticenergy: 952.95155505 hartree
xcener: -92.380148725800 hartree
chargesum: -0.0000000
charge: -0.341065 -0.270595 -0.382653 -0.353790 -0.100179 0.422497 0.044166 0.110718 -0.342409 -0.304149 -0.295564 0.210251 -0.000034 -0.093860 -0.168331 -0.015698 -0.078181 -0.116958 0.404407 -0.220540 -0.130057 0.051455 0.104777 0.096914 0.108902 0.091690 0.099125 0.074075 0.095929 0.080552 0.082194 0.143950 0.117456 0.134994 0.114910 0.087713 0.108365 0.091887 0.111201 0.113976 0.111959
qa: -0.3411 -0.2706 -0.3827 -0.3538 -0.1002 0.4225 0.0442 0.1107 -0.3424 -0.3041 -0.2956 0.2103 -0.0000 -0.0939 -0.1683 -0.0157 -0.0782 -0.1170 0.4044 -0.2205 -0.1301 0.0515 0.1048 0.0969 0.1089 0.0917 0.0991 0.0741 0.0959 0.0806 0.0822 0.1440 0.1175 0.1350 0.1149 0.0877 0.1084 0.0919 0.1112 0.1140 0.1120
va: 2.1962 2.1286 2.1119 3.0514 3.1708 3.5318 3.8445 4.3249 3.9989 3.9497 3.9421 3.9563 3.7031 3.8710 4.0150 3.8238 3.9736 3.9576 4.1540 3.9174 3.8985 1.0318 1.0085 1.0035 1.0089 1.0081 1.0066 1.0122 1.0156 1.0070 1.0034 1.0360 1.0118 1.0237 1.0071 1.0041 0.9923 1.0034 0.9952 0.9951 0.9951
dispcorr: -0.020288554 hartree
energy: -957.077863204426
dipole: -8.66280 10.80950 2.14669 9.50334 -8.94388 0.55946 -7.18085 6.99149 -0.18936
magnitude: 2.22646 au
magnitude: 5.65922 debye
