program: Orca
programVersion: 5.0.2
elementType: O O O N N C C C C C C C C C C C C C C C C H H H H H H H H H H H H H H H H H H H H
charge: 0
multiplicity: 1
keywords: wb97x-d3
keywords: def2-TZVPP
keywords: def2/J RIJCOSX
keywords: DEFGRID2
keywords: scfconv7
keywords: smallprint printgap noloewdin
keywords: NOSOSCF
formula: C16H20N2O3
InChI: InChI=1/C16H20N2O3/c1-9(2)16(4)15(20)17-13(18-16)12-8-10(3)6-7-11(12)14(19)21-5/h6-9,17H,1-5H3
41 atoms
O  -2.999762 -1.677359 1.163874
O  2.956737 -2.459308 -0.697876
O  0.786738 -2.08176 -1.042469
N  -1.201092 0.765016 -0.686217
N  -0.891883 -0.793494 0.887976
C  -2.500558 0.151176 -0.435371
C  -3.494793 1.238484 0.030019
C  -2.237656 -0.904302 0.642752
C  -2.952102 -0.551772 -1.714768
C  -4.933757 0.743409 0.135947
C  -3.059445 1.886017 1.34174
C  -0.355724 0.165113 0.043219
C  1.073812 0.538173 0.118283
C  2.133289 -0.338897 -0.142877
C  1.348385 1.845061 0.497479
C  2.650363 2.309353 0.643768
C  3.439251 0.119528 0.01438
C  3.692583 1.420002 0.40748
C  1.864515 -1.700726 -0.669988
C  2.922207 3.734758 1.017053
C  2.811746 -3.767952 -1.23419
H  -3.452855 2.004765 -0.751494
H  -3.162366 0.185026 -2.490148
H  -2.167111 -1.212856 -2.081415
H  -3.845613 -1.149014 -1.542203
H  -5.579298 1.557205 0.468751
H  -5.323495 0.398657 -0.820999
H  -5.031389 -0.071854 0.851482
H  -3.121505 1.186576 2.177825
H  -3.710285 2.728008 1.580304
H  -2.0405 2.269358 1.289439
H  -0.374517 -1.416938 1.484078
H  0.516323 2.512727 0.682865
H  4.269604 -0.541728 -0.186413
H  4.717626 1.750512 0.521668
H  3.831067 3.828329 1.610252
H  3.053133 4.347209 0.122785
H  2.101416 4.166079 1.588071
H  2.106227 -4.363069 -0.655051
H  3.796798 -4.221983 -1.182479
H  2.476308 -3.741839 -2.270588
totalener: -957.05673487 hartree
nucrepener: 1725.66699078 hartree
electener: -2682.72372565 hartree
oneelecener: -4729.55227776 hartree
twoeener: 2046.82855210 hartree
kineticenergy: 952.95901664 hartree
xcener: -92.381552744158 hartree
chargesum: -0.0000000
charge: -0.351161 -0.269771 -0.369355 -0.328951 -0.109408 0.429147 0.009845 0.111152 -0.336023 -0.282281 -0.293907 0.211157 0.031627 -0.121301 -0.181727 -0.005013 -0.093161 -0.116581 0.397633 -0.218817 -0.128009 0.041469 0.099028 0.110963 0.099153 0.079360 0.079363 0.103706 0.091266 0.087909 0.086178 0.141671 0.119663 0.135635 0.115404 0.089314 0.107715 0.089782 0.109725 0.114422 0.113178
qa: -0.3512 -0.2698 -0.3694 -0.3290 -0.1094 0.4291 0.0098 0.1112 -0.3360 -0.2823 -0.2939 0.2112 0.0316 -0.1213 -0.1817 -0.0050 -0.0932 -0.1166 0.3976 -0.2188 -0.1280 0.0415 0.0990 0.1110 0.0992 0.0794 0.0794 0.1037 0.0913 0.0879 0.0862 0.1417 0.1197 0.1356 0.1154 0.0893 0.1077 0.0898 0.1097 0.1144 0.1132
va: 2.1724 2.1248 2.1193 3.0535 3.1967 3.5531 3.9078 4.3286 3.9858 3.9464 3.9446 4.0314 3.6979 3.8283 4.0277 3.8193 3.9906 3.9650 4.1618 3.9175 3.8973 1.0285 1.0037 1.0112 1.0051 1.0060 1.0043 1.0148 1.0066 1.0062 1.0081 1.0365 1.0246 1.0244 1.0065 1.0026 0.9928 1.0054 0.9949 0.9946 0.9954
dispcorr: -0.020230783 hartree
energy: -957.076965656780
dipole: -10.29110 12.43133 2.14024 9.93960 -9.47006 0.46954 0.21143 -0.04183 0.16960
magnitude: 2.19769 au
magnitude: 5.58609 debye
