program: Orca
programVersion: 5.0.2
elementType: O O O N N C C C C C C C C C C C C C C C C H H H H H H H H H H H H H H H H H H H H
charge: 0
multiplicity: 1
keywords: wb97x-d3
keywords: def2-TZVPP
keywords: def2/J RIJCOSX
keywords: DEFGRID2
keywords: scfconv7
keywords: smallprint printgap noloewdin
keywords: NOSOSCF
formula: C16H20N2O3
InChI: InChI=1/C16H20N2O3/c1-9(2)16(4)15(20)17-13(18-16)12-8-10(3)6-7-11(12)14(19)21-5/h6-9,17H,1-5H3
41 atoms
O  -2.534943 -2.057353 1.306058
O  1.064906 -1.853894 -1.316998
O  3.036876 -2.463973 -0.460634
N  -1.173141 0.697125 -0.476065
N  -0.558479 -0.960735 0.890456
C  -2.388243 -0.029013 -0.126723
C  -3.345215 0.928005 0.63363
C  -1.912334 -1.166189 0.789249
C  -3.00396 -0.624518 -1.389833
C  -3.57948 2.222098 -0.140446
C  -4.680814 0.285038 0.995514
C  -0.203044 0.125611 0.106495
C  1.191994 0.603734 0.066479
C  2.292181 -0.220259 -0.189522
C  1.399654 1.944029 0.370136
C  2.675188 2.487651 0.448469
C  3.573034 0.313825 -0.084869
C  3.762008 1.646221 0.227976
C  2.188739 -1.633157 -0.645325
C  2.878899 3.932498 0.792009
C  0.822858 -3.180286 -1.767511
H  -2.833997 1.192863 1.567361
H  -3.853103 -1.261989 -1.149333
H  -3.332932 0.16282 -2.066139
H  -2.269569 -1.227924 -1.924242
H  -4.132199 2.04343 -1.064404
H  -4.177904 2.907895 0.460996
H  -2.646945 2.718377 -0.399236
H  -5.256886 0.967518 1.621893
H  -4.567593 -0.649723 1.539883
H  -5.28026 0.086956 0.105417
H  0.058186 -1.515765 1.460509
H  0.534516 2.568147 0.555195
H  4.425753 -0.324053 -0.273924
H  4.768842 2.040591 0.291357
H  3.637135 4.389474 0.156197
H  1.960036 4.505732 0.680676
H  3.212949 4.044082 1.825196
H  -0.136287 -3.150005 -2.277173
H  0.769107 -3.883184 -0.935486
H  1.595531 -3.5138 -2.460243
totalener: -957.05477180 hartree
nucrepener: 1734.99807768 hartree
electener: -2692.05284948 hartree
oneelecener: -4747.64072412 hartree
twoeener: 2055.58787463 hartree
kineticenergy: 952.95637947 hartree
xcener: -92.379608869447 hartree
chargesum: 0.0000000
charge: -0.351806 -0.254204 -0.353356 -0.360264 -0.125444 0.415561 0.016592 0.140754 -0.347463 -0.279407 -0.285537 0.221622 0.045083 -0.137642 -0.159807 -0.007373 -0.079258 -0.121970 0.348039 -0.219034 -0.127742 0.042131 0.106099 0.105165 0.093945 0.070474 0.085156 0.100476 0.084020 0.113363 0.072390 0.148692 0.113895 0.135298 0.118456 0.095415 0.087510 0.104291 0.109275 0.115428 0.121177
qa: -0.3518 -0.2542 -0.3534 -0.3603 -0.1254 0.4156 0.0166 0.1408 -0.3475 -0.2794 -0.2855 0.2216 0.0451 -0.1376 -0.1598 -0.0074 -0.0793 -0.1220 0.3480 -0.2190 -0.1277 0.0421 0.1061 0.1052 0.0939 0.0705 0.0852 0.1005 0.0840 0.1134 0.0724 0.1487 0.1139 0.1353 0.1185 0.0954 0.0875 0.1043 0.1093 0.1154 0.1212
va: 2.1690 2.1066 2.1530 2.9930 3.2025 3.5188 3.9350 4.3125 4.0250 3.9363 3.9429 4.0735 3.6030 3.8470 4.0212 3.8195 3.9909 3.9657 4.2111 3.9135 3.8865 1.0092 1.0043 1.0026 1.0094 1.0061 1.0039 1.0218 1.0063 1.0206 1.0009 1.0313 1.0271 1.0193 1.0051 1.0001 1.0079 0.9933 0.9925 0.9949 0.9961
dispcorr: -0.020687712 hartree
energy: -957.075459513629
dipole: -16.63885 17.32293 0.68408 11.37397 -10.36753 1.00644 -1.95216 1.80330 -0.14886
magnitude: 1.22599 au
magnitude: 3.11622 debye
