program: Orca
programVersion: 5.0.2
elementType: O O O N N C C C C C C C C C C C C C C C C H H H H H H H H H H H H H H H H H H H H
charge: 0
multiplicity: 1
keywords: wb97x-d3
keywords: def2-TZVPP
keywords: def2/J RIJCOSX
keywords: DEFGRID2
keywords: scfconv7
keywords: smallprint printgap noloewdin
keywords: NOSOSCF
formula: C16H20N2O3
InChI: InChI=1/C16H20N2O3/c1-9(2)16(4)15(20)17-13(18-16)11-7-6-10(3)8-12(11)14(19)21-5/h6-9,17H,1-5H3
41 atoms
O  -3.237741 0.930212 -2.019137
O  2.629222 2.063458 1.224878
O  0.767122 2.211814 0.005191
N  -1.254768 -0.235326 0.685946
N  -1.115611 0.195738 -1.509249
C  -2.561884 0.249332 0.257108
C  -3.669137 -0.79929 0.493613
C  -2.407874 0.511929 -1.235963
C  -2.863494 1.580118 0.944041
C  -3.411915 -2.092966 -0.272973
C  -3.882967 -1.096326 1.972505
C  -0.499897 -0.213499 -0.338002
C  0.909164 -0.655574 -0.363227
C  1.96772 0.15886 0.042628
C  1.171706 -1.961005 -0.759276
C  3.264113 -0.351218 0.050518
C  3.533424 -1.653437 -0.352059
C  2.465927 -2.451401 -0.756846
C  1.711324 1.574098 0.412195
C  4.930915 -2.192059 -0.352044
C  2.51019 3.437002 1.606114
H  -4.588643 -0.351159 0.102697
H  -3.851787 1.94294 0.660725
H  -2.835773 1.471827 2.026525
H  -2.130439 2.339537 0.669401
H  -3.360336 -1.941794 -1.352363
H  -2.485621 -2.574367 0.044487
H  -4.222751 -2.799748 -0.09262
H  -2.99498 -1.536348 2.427698
H  -4.699483 -1.810226 2.090688
H  -4.150171 -0.20791 2.544138
H  -0.661993 0.282014 -2.408505
H  0.354217 -2.602637 -1.062978
H  4.090029 0.277468 0.356135
H  2.647164 -3.471953 -1.071195
H  5.650765 -1.439139 -0.035528
H  5.021617 -3.046279 0.320183
H  5.21976 -2.53612 -1.345939
H  1.586052 3.615079 2.154837
H  2.553356 4.094996 0.738745
H  3.357939 3.639241 2.253559
elementType: O N C H
totalener: -957.07857282 hartree
nucrepener: 1726.58085461 hartree
electener: -2683.65942743 hartree
oneelecener: -4732.21669495 hartree
twoeener: 2048.55726751 hartree
cpcmener: -0.04171703 hartree
kineticenergy: 952.89239701 hartree
xcener: -92.378908471286 hartree
chargesum: -0.0000000
charge: -0.496025 -0.278105 -0.481482 -0.407430 -0.062203 0.429626 0.045497 0.191116 -0.353879 -0.305613 -0.311048 0.244573 -0.081726 -0.016857 -0.155508 -0.138960 -0.013783 -0.160578 0.450776 -0.213747 -0.127327 0.047203 0.109635 0.107441 0.113165 0.099438 0.083928 0.102356 0.083024 0.097139 0.096316 0.186505 0.155571 0.139257 0.147967 0.093282 0.106132 0.105479 0.118875 0.121177 0.128788
qa: -0.4960 -0.2781 -0.4815 -0.4074 -0.0622 0.4296 0.0455 0.1911 -0.3539 -0.3056 -0.3110 0.2446 -0.0817 -0.0169 -0.1555 -0.1390 -0.0138 -0.1606 0.4508 -0.2137 -0.1273 0.0472 0.1096 0.1074 0.1132 0.0994 0.0839 0.1024 0.0830 0.0971 0.0963 0.1865 0.1556 0.1393 0.1480 0.0933 0.1061 0.1055 0.1189 0.1212 0.1288
va: 2.0274 2.1416 2.0101 3.0409 3.2115 3.5214 3.8254 4.2809 3.9964 3.9351 3.9456 3.9254 3.6932 3.7941 3.9379 3.9753 3.8106 3.9352 4.1200 3.9065 3.8628 1.0324 1.0079 1.0015 1.0054 1.0074 1.0102 1.0041 1.0151 1.0042 0.9994 1.0048 0.9999 1.0253 0.9974 1.0063 0.9951 0.9954 0.9923 0.9931 0.9956
dispcorr: -0.020309444 hartree
energy: -957.098882268705
dipole: -5.29132 8.30387 3.01254 -6.45940 5.42268 -1.03672 8.37296 -8.10117 0.27179
magnitude: 3.19751 au
magnitude: 8.12742 debye
