program: Orca
programVersion: 5.0.2
elementType: O O O N N C C C C C C C C C C C C C C C C H H H H H H H H H H H H H H H H H H H H
charge: 0
multiplicity: 1
keywords: wb97x-d3
keywords: def2-TZVPP
keywords: def2/J RIJCOSX
keywords: DEFGRID2
keywords: scfconv7
keywords: smallprint printgap noloewdin
keywords: NOSOSCF
formula: C16H20N2O3
InChI: InChI=1/C16H20N2O3/c1-9(2)16(4)15(20)17-13(18-16)11-7-6-10(3)8-12(11)14(19)21-5/h6-9,17H,1-5H3
41 atoms
O  -3.638111 -1.366534 1.450592
O  1.624604 1.600374 -1.702148
O  0.981395 2.202594 0.352837
N  -1.025732 -0.08588 -0.574587
N  -1.343742 -1.332361 1.256971
C  -2.464242 -0.197776 -0.381923
C  -3.141406 1.178629 -0.211209
C  -2.616961 -1.027633 0.886874
C  -3.068958 -0.99734 -1.538021
C  -2.642698 1.924553 1.022253
C  -2.987387 2.050735 -1.450956
C  -0.463699 -0.741772 0.362753
C  0.982915 -0.932763 0.488631
C  1.876623 0.028063 0.006595
C  1.49536 -2.12002 0.999806
C  3.240214 -0.215746 0.023263
C  3.755943 -1.405708 0.535411
C  2.861668 -2.349436 1.026668
C  1.417193 1.382528 -0.41847
C  5.231768 -1.65541 0.534922
C  1.293329 2.897322 -2.209188
H  -4.207015 0.96855 -0.071907
H  -2.857249 -0.518688 -2.492103
H  -2.657461 -2.006831 -1.57494
H  -4.150448 -1.074055 -1.424854
H  -2.810995 1.373244 1.948787
H  -1.578735 2.151178 0.954375
H  -3.170633 2.873841 1.120781
H  -3.436715 1.603482 -2.337394
H  -1.937789 2.254421 -1.669377
H  -3.480405 3.010725 -1.291191
H  -1.087056 -1.866563 2.076241
H  0.828774 -2.892754 1.360464
H  3.923019 0.54115 -0.345309
H  3.234031 -3.282539 1.42982
H  5.495853 -2.489979 1.182208
H  5.583196 -1.892856 -0.470917
H  5.784418 -0.776821 0.867266
H  1.901057 3.671413 -1.74169
H  0.236953 3.121988 -2.061063
H  1.507507 2.864556 -3.273044
elementType: O N C H
totalener: -957.07792939 hartree
nucrepener: 1748.70208305 hartree
electener: -2705.78001244 hartree
oneelecener: -4776.37830391 hartree
twoeener: 2070.59829147 hartree
cpcmener: -0.04447356 hartree
kineticenergy: 952.89301731 hartree
xcener: -92.380886402855 hartree
chargesum: -0.0000000
charge: -0.493653 -0.274037 -0.471590 -0.424997 -0.100162 0.393231 0.046524 0.197549 -0.341462 -0.315853 -0.305624 0.355495 -0.072440 -0.082542 -0.150623 -0.126745 -0.026577 -0.149667 0.448273 -0.211732 -0.134926 0.046463 0.106984 0.118115 0.107566 0.098982 0.089525 0.101791 0.099235 0.076988 0.097407 0.186164 0.140583 0.140479 0.147023 0.096577 0.108804 0.103798 0.125850 0.117257 0.131971
qa: -0.4937 -0.2740 -0.4716 -0.4250 -0.1002 0.3932 0.0465 0.1975 -0.3415 -0.3159 -0.3056 0.3555 -0.0724 -0.0825 -0.1506 -0.1267 -0.0266 -0.1497 0.4483 -0.2117 -0.1349 0.0465 0.1070 0.1181 0.1076 0.0990 0.0895 0.1018 0.0992 0.0770 0.0974 0.1862 0.1406 0.1405 0.1470 0.0966 0.1088 0.1038 0.1258 0.1173 0.1320
va: 2.0283 2.1212 2.0174 3.0394 3.2615 3.5863 3.8137 4.2715 3.9861 3.9392 3.9652 3.9403 3.6745 3.8101 3.9447 3.9541 3.8132 3.9298 4.1789 3.9058 3.8650 1.0316 1.0022 0.9988 1.0076 1.0093 1.0118 1.0046 1.0006 1.0020 1.0048 1.0069 1.0110 1.0102 0.9998 1.0038 0.9939 0.9981 0.9939 0.9795 0.9949
dispcorr: -0.021246383 hartree
energy: -957.099175772232
dipole: -3.03565 5.54519 2.50953 7.15031 -8.02113 -0.87082 -7.28815 6.62936 -0.65879
magnitude: 2.73681 au
magnitude: 6.95641 debye
