program: Orca
programVersion: 5.0.2
elementType: O O O N N C C C C C C C C C C C C C C C C H H H H H H H H H H H H H H H H H H H H
charge: 0
multiplicity: 1
keywords: wb97x-d3
keywords: def2-TZVPP
keywords: def2/J RIJCOSX
keywords: DEFGRID2
keywords: scfconv7
keywords: smallprint printgap noloewdin
keywords: NOSOSCF
formula: C16H20N2O3
InChI: InChI=1/C16H20N2O3/c1-9(2)16(4)15(20)17-13(18-16)11-7-6-10(3)8-12(11)14(19)21-5/h6-9,17H,1-5H3
41 atoms
O  -2.949052 1.060927 1.693129
O  0.884381 1.816657 -0.807482
O  2.432267 2.349811 0.714143
N  -1.258966 -1.142472 -0.518265
N  -0.850131 0.332937 1.111955
C  -2.550508 -0.623006 -0.079847
C  -3.283762 0.018712 -1.280513
C  -2.205827 0.382264 1.012469
C  -3.352334 -1.764708 0.543808
C  -4.718923 0.435977 -0.979398
C  -2.51099 1.195054 -1.867074
C  -0.361089 -0.577908 0.187247
C  1.073772 -0.898673 0.12813
C  2.087842 0.064704 0.14743
C  1.434893 -2.242116 0.129762
C  3.41987 -0.328579 0.195978
C  3.781893 -1.670749 0.187966
C  2.765737 -2.62121 0.150215
C  1.825889 1.526642 0.070998
C  5.221879 -2.078693 0.191526
C  0.500916 3.189025 -0.939087
H  -3.321445 -0.77261 -2.036058
H  -4.264137 -1.400429 1.013805
H  -3.62758 -2.490553 -0.221431
H  -2.766686 -2.278653 1.306638
H  -5.334882 -0.393555 -0.634267
H  -4.77085 1.229816 -0.234543
H  -5.180284 0.819324 -1.890321
H  -2.466489 2.038093 -1.173601
H  -3.006398 1.551132 -2.771026
H  -1.49247 0.92498 -2.143268
H  -0.304727 0.832005 1.802281
H  0.663209 -2.999583 0.139557
H  4.195728 0.427056 0.212972
H  3.015773 -3.6748 0.152174
H  5.859299 -1.294927 0.597991
H  5.377423 -2.985206 0.775325
H  5.565038 -2.286062 -0.824004
H  -0.226522 3.219402 -1.743637
H  1.352771 3.814421 -1.200544
H  0.043143 3.554805 -0.020753
elementType: O N C H
totalener: -957.07775330 hartree
nucrepener: 1747.67041998 hartree
electener: -2704.74817328 hartree
oneelecener: -4773.21706764 hartree
twoeener: 2068.46889436 hartree
cpcmener: -0.03999806 hartree
kineticenergy: 952.89707317 hartree
xcener: -92.379389115106 hartree
chargesum: -0.0000000
charge: -0.496756 -0.262979 -0.472115 -0.404301 -0.085350 0.433171 0.035053 0.188150 -0.338284 -0.310650 -0.330067 0.284992 -0.014215 -0.078480 -0.205252 -0.115888 -0.022881 -0.140389 0.433395 -0.211701 -0.136517 0.045539 0.103509 0.110785 0.117081 0.096870 0.086297 0.098024 0.088403 0.106751 0.096494 0.183144 0.142903 0.134011 0.147078 0.098279 0.101263 0.108215 0.124745 0.131810 0.129867
qa: -0.4968 -0.2630 -0.4721 -0.4043 -0.0853 0.4332 0.0351 0.1881 -0.3383 -0.3106 -0.3301 0.2850 -0.0142 -0.0785 -0.2053 -0.1159 -0.0229 -0.1404 0.4334 -0.2117 -0.1365 0.0455 0.1035 0.1108 0.1171 0.0969 0.0863 0.0980 0.0884 0.1068 0.0965 0.1831 0.1429 0.1340 0.1471 0.0983 0.1013 0.1082 0.1247 0.1318 0.1299
va: 2.0143 2.1279 2.0276 3.0520 3.2475 3.5571 3.8646 4.2800 3.9780 3.9508 3.9356 3.9241 3.6156 3.8195 4.0046 3.9500 3.8335 3.9310 4.1321 3.9039 3.8443 1.0285 1.0038 1.0028 1.0002 1.0002 1.0143 1.0036 0.9995 1.0061 1.0133 1.0077 1.0253 1.0213 0.9985 1.0030 0.9998 0.9940 0.9917 0.9973 0.9916
dispcorr: -0.021765611 hartree
energy: -957.099518908897
dipole: -10.24088 11.61690 1.37602 -1.83633 0.82115 -1.01518 -8.21929 7.45602 -0.76327
magnitude: 1.87259 au
magnitude: 4.75973 debye
