program: Orca
programVersion: 5.0.2
elementType: O O O N N C C C C C C C C C C C C C C C C H H H H H H H H H H H H H H H H H H H H
charge: 0
multiplicity: 1
keywords: wb97x-d3
keywords: def2-TZVPP
keywords: def2/J RIJCOSX
keywords: DEFGRID2
keywords: scfconv7
keywords: smallprint printgap noloewdin
keywords: NOSOSCF
formula: C16H20N2O3
InChI: InChI=1/C16H20N2O3/c1-9(2)16(4)15(20)17-13(18-16)11-7-6-10(3)8-12(11)14(19)21-5/h6-9,17H,1-5H3
41 atoms
O  -3.722237 -1.758411 0.712171
O  1.571107 1.623509 -1.620077
O  1.016491 2.203082 0.469629
N  -1.001861 0.117996 -0.55594
N  -1.420836 -1.703177 0.669982
C  -2.447098 0.005301 -0.452426
C  -3.048944 1.225478 0.287467
C  -2.670235 -1.251446 0.377822
C  -3.06937 -0.19925 -1.831361
C  -2.52219 1.36082 1.713507
C  -2.833244 2.527531 -0.473167
C  -0.489798 -0.840763 0.109452
C  0.947945 -1.040006 0.291941
C  1.840155 0.00691 0.032469
C  1.466834 -2.263552 0.70373
C  3.202615 -0.182767 0.184137
C  3.722116 -1.404861 0.609538
C  2.832119 -2.441102 0.862042
C  1.391457 1.385274 -0.334699
C  5.198192 -1.574832 0.784723
C  1.243583 2.930475 -2.102094
H  -4.125951 1.034775 0.340153
H  -2.80758 0.618719 -2.499602
H  -2.718238 -1.125868 -2.286618
H  -4.155762 -0.246591 -1.75685
H  -2.990569 2.216413 2.201496
H  -2.740468 0.489089 2.332495
H  -1.444303 1.527795 1.733608
H  -3.317939 3.347428 0.058237
H  -3.253677 2.503845 -1.47805
H  -1.773785 2.773405 -0.55534
H  -1.22122 -2.50342 1.253539
H  0.815626 -3.105963 0.896842
H  3.881693 0.638654 -0.014094
H  3.206484 -3.403646 1.186095
H  5.725324 -1.416721 -0.157224
H  5.594168 -0.84926 1.496362
H  5.446486 -2.571105 1.145875
H  0.17766 3.131679 -1.996375
H  1.507497 2.932715 -3.15524
H  1.814653 3.700833 -1.585734
elementType: O N C H
totalener: -957.07726524 hartree
nucrepener: 1754.20145113 hartree
electener: -2711.27871636 hartree
oneelecener: -4787.40067281 hartree
twoeener: 2076.12195644 hartree
cpcmener: -0.04481723 hartree
kineticenergy: 952.89552307 hartree
xcener: -92.383608085475 hartree
chargesum: -0.0000000
charge: -0.494412 -0.273067 -0.473570 -0.411537 -0.103703 0.370695 0.043951 0.202899 -0.331653 -0.311975 -0.307547 0.331512 -0.037266 -0.085746 -0.153044 -0.120323 -0.036356 -0.141151 0.455758 -0.213413 -0.136509 0.049767 0.106172 0.116230 0.106286 0.102270 0.099905 0.084249 0.101763 0.098841 0.068778 0.181696 0.138775 0.139850 0.147261 0.107801 0.107510 0.094732 0.121398 0.133339 0.119837
qa: -0.4944 -0.2731 -0.4736 -0.4115 -0.1037 0.3707 0.0440 0.2029 -0.3317 -0.3120 -0.3075 0.3315 -0.0373 -0.0857 -0.1530 -0.1203 -0.0364 -0.1412 0.4558 -0.2134 -0.1365 0.0498 0.1062 0.1162 0.1063 0.1023 0.0999 0.0842 0.1018 0.0988 0.0688 0.1817 0.1388 0.1399 0.1473 0.1078 0.1075 0.0947 0.1214 0.1333 0.1198
va: 2.0271 2.1208 2.0144 3.0242 3.2690 3.6094 3.8058 4.2605 3.9739 3.9361 3.9594 3.9784 3.6531 3.8130 3.9608 3.9512 3.8217 3.9053 4.1783 3.9086 3.8736 1.0308 1.0018 1.0000 1.0080 1.0042 1.0079 1.0152 1.0063 0.9995 1.0129 1.0114 1.0070 1.0075 0.9999 0.9950 0.9956 1.0051 0.9805 0.9948 0.9945
dispcorr: -0.021489746 hartree
energy: -957.098754982376
dipole: -2.44141 4.87680 2.43539 9.14446 -10.00431 -0.85985 -2.72860 2.16196 -0.56665
magnitude: 2.64416 au
magnitude: 6.72091 debye
