program: Orca
programVersion: 5.0.2
elementType: O O O N N C C C C C C C C C C C C C C C C H H H H H H H H H H H H H H H H H H H H
charge: 0
multiplicity: 1
keywords: wb97x-d3
keywords: def2-TZVPP
keywords: def2/J RIJCOSX
keywords: DEFGRID2
keywords: scfconv7
keywords: smallprint printgap noloewdin
keywords: NOSOSCF
formula: C16H20N2O3
InChI: InChI=1/C16H20N2O3/c1-9(2)16(4)15(20)17-13(18-16)11-7-6-10(3)8-12(11)14(19)21-5/h6-9,17H,1-5H3
41 atoms
O  -2.8155 1.93742 -0.920284
O  1.013873 1.595339 1.538729
O  2.70887 2.443102 0.353595
N  -1.26813 -0.907683 0.531838
N  -0.7774 0.899561 -0.687716
C  -2.514133 -0.174945 0.339741
C  -3.530486 -1.095207 -0.378805
C  -2.12079 1.035162 -0.504619
C  -3.01476 0.305034 1.700583
C  -4.941576 -0.522439 -0.447827
C  -3.054565 -1.498852 -1.770639
C  -0.347122 -0.255335 -0.051216
C  1.056307 -0.693631 -0.141779
C  2.147724 0.140953 0.120009
C  1.299093 -1.99385 -0.570209
C  3.441494 -0.324367 -0.082917
C  3.687109 -1.625404 -0.508627
C  2.593463 -2.453662 -0.743462
C  1.997316 1.519016 0.660233
C  5.087314 -2.127609 -0.680196
C  0.695048 2.881527 2.071316
H  -3.56841 -1.998318 0.239617
H  -3.868224 0.974041 1.600515
H  -3.313065 -0.54554 2.314367
H  -2.229909 0.845471 2.23218
H  -4.988107 0.400589 -1.026323
H  -5.602914 -1.241993 -0.933627
H  -5.36018 -0.32352 0.538527
H  -3.727426 -2.246514 -2.193479
H  -2.056297 -1.937876 -1.759019
H  -3.045393 -0.652689 -2.462062
H  -0.206784 1.515396 -1.251487
H  0.46391 -2.645555 -0.790844
H  4.278415 0.332542 0.121269
H  2.752365 -3.470853 -1.080629
H  5.783646 -1.315316 -0.885338
H  5.431672 -2.631241 0.225741
H  5.156096 -2.848083 -1.494909
H  1.547196 3.321008 2.588654
H  -0.110122 2.719582 2.781634
H  0.35475 3.558831 1.288016
elementType: O N C H
totalener: -957.08147326 hartree
nucrepener: 1739.83146319 hartree
electener: -2696.91293645 hartree
oneelecener: -4757.49224932 hartree
twoeener: 2060.57931287 hartree
cpcmener: -0.03392528 hartree
kineticenergy: 952.89445578 hartree
xcener: -92.375879866982 hartree
chargesum: -0.0000000
charge: -0.460405 -0.263736 -0.445276 -0.377940 -0.080867 0.462665 0.020359 0.141370 -0.342981 -0.308047 -0.304166 0.233955 -0.013687 -0.062612 -0.208823 -0.112553 -0.017612 -0.146012 0.411393 -0.212410 -0.134486 0.044614 0.102688 0.110101 0.110145 0.088993 0.095809 0.094817 0.100094 0.097829 0.091329 0.181714 0.145585 0.131831 0.143628 0.097914 0.108019 0.099174 0.127364 0.125805 0.124419
qa: -0.4604 -0.2637 -0.4453 -0.3779 -0.0809 0.4627 0.0204 0.1414 -0.3430 -0.3080 -0.3042 0.2340 -0.0137 -0.0626 -0.2088 -0.1126 -0.0176 -0.1460 0.4114 -0.2124 -0.1345 0.0446 0.1027 0.1101 0.1101 0.0890 0.0958 0.0948 0.1001 0.0978 0.0913 0.1817 0.1456 0.1318 0.1436 0.0979 0.1080 0.0992 0.1274 0.1258 0.1244
va: 2.0601 2.1218 2.0626 3.0697 3.2121 3.4957 3.8790 4.3161 3.9907 3.9482 3.9337 4.0660 3.5795 3.7875 4.0236 3.9531 3.8257 3.9486 4.1576 3.9045 3.8533 1.0297 1.0039 1.0023 1.0040 1.0148 1.0041 1.0004 1.0037 1.0036 1.0048 1.0080 1.0181 1.0230 0.9997 1.0024 0.9937 1.0004 0.9962 0.9930 0.9916
dispcorr: -0.021282229 hartree
energy: -957.102755484855
dipole: -11.75845 12.91627 1.15782 -7.89294 6.66809 -1.22485 -0.03808 0.24327 0.20519
magnitude: 1.69792 au
magnitude: 4.31576 debye
