program: Orca
programVersion: 5.0.2
elementType: O O O N N C C C C C C C C C C C C C C C C H H H H H H H H H H H H H H H H H H H H
charge: 0
multiplicity: 1
keywords: wb97x-d3
keywords: def2-TZVPP
keywords: def2/J RIJCOSX
keywords: DEFGRID2
keywords: scfconv7
keywords: smallprint printgap noloewdin
keywords: NOSOSCF
formula: C16H20N2O3
InChI: InChI=1/C16H20N2O3/c1-9(2)16(4)15(20)17-13(18-16)11-7-6-10(3)8-12(11)14(19)21-5/h6-9,17H,1-5H3
41 atoms
O  -3.05156 1.13434 1.863887
O  2.506461 2.405907 0.261352
O  0.554965 1.965669 -0.728183
N  -1.423993 -1.140441 -0.313598
N  -0.960636 0.413777 1.224517
C  -2.697934 -0.637258 0.1765
C  -3.539873 -0.033665 -0.968322
C  -2.321455 0.435024 1.19553
C  -3.435945 -1.752736 0.918324
C  -2.814614 1.106698 -1.676082
C  -3.972112 -1.090596 -1.97826
C  -0.5037 -0.516315 0.303677
C  0.930669 -0.811128 0.137517
C  1.926777 0.159811 -0.012712
C  1.304219 -2.151102 0.165719
C  3.260076 -0.228417 -0.114333
C  3.63281 -1.566994 -0.09339
C  2.631221 -2.523189 0.048128
C  1.572746 1.592187 -0.197721
C  5.065142 -1.97443 -0.248946
C  2.316875 3.808021 0.066063
H  -4.439329 0.376418 -0.496373
H  -2.877102 -2.07614 1.798216
H  -4.418626 -1.413556 1.247871
H  -3.568994 -2.621854 0.276329
H  -1.905785 0.761149 -2.170986
H  -3.459185 1.536906 -2.444286
H  -2.545046 1.920484 -1.000358
H  -4.546214 -0.626695 -2.782048
H  -4.608436 -1.857448 -1.536292
H  -3.112614 -1.586522 -2.432074
H  -0.387319 0.975659 1.838003
H  0.543863 -2.909607 0.295784
H  4.028165 0.522802 -0.245551
H  2.890671 -3.57484 0.071806
H  5.233296 -2.435027 -1.224518
H  5.73834 -1.122425 -0.166342
H  5.354184 -2.708173 0.504211
H  3.205453 4.286483 0.468542
H  1.439669 4.168038 0.603745
H  2.222532 4.055805 -0.991303
elementType: O N C H
totalener: -957.08303515 hartree
nucrepener: 1730.24292274 hartree
electener: -2687.32595789 hartree
oneelecener: -4739.26688436 hartree
twoeener: 2051.94092647 hartree
cpcmener: -0.03530664 hartree
kineticenergy: 952.89267006 hartree
xcener: -92.377412255707 hartree
chargesum: -0.0000000
charge: -0.461561 -0.276701 -0.441079 -0.424960 -0.100149 0.420318 0.044479 0.172693 -0.343219 -0.303723 -0.315069 0.295440 -0.002297 -0.086068 -0.187362 -0.132753 -0.013581 -0.144697 0.440448 -0.213992 -0.125133 0.046438 0.115206 0.108695 0.104916 0.080028 0.101642 0.094712 0.094398 0.095187 0.086150 0.182399 0.140397 0.135222 0.144586 0.107516 0.093867 0.102994 0.127479 0.118189 0.118945
qa: -0.4616 -0.2767 -0.4411 -0.4250 -0.1001 0.4203 0.0445 0.1727 -0.3432 -0.3037 -0.3151 0.2954 -0.0023 -0.0861 -0.1874 -0.1328 -0.0136 -0.1447 0.4404 -0.2140 -0.1251 0.0464 0.1152 0.1087 0.1049 0.0800 0.1016 0.0947 0.0944 0.0952 0.0861 0.1824 0.1404 0.1352 0.1446 0.1075 0.0939 0.1030 0.1275 0.1182 0.1189
va: 2.0724 2.1364 2.0548 3.0388 3.2353 3.5267 3.8222 4.3054 3.9848 3.9309 3.9426 3.9022 3.6234 3.8029 3.9926 3.9705 3.8211 3.9414 4.1391 3.9059 3.8648 1.0318 0.9990 1.0074 1.0024 1.0165 1.0065 1.0101 1.0050 0.9990 1.0161 1.0074 1.0264 1.0267 0.9988 0.9940 1.0057 0.9974 0.9952 0.9922 0.9936
dispcorr: -0.020342868 hartree
energy: -957.103378018047
dipole: -5.02055 8.06949 3.04895 -3.93590 3.50711 -0.42879 -7.79539 8.06147 0.26608
magnitude: 3.09043 au
magnitude: 7.85524 debye
