program: Orca
programVersion: 5.0.2
elementType: O O O N N C C C C C C C C C C C C C C C C H H H H H H H H H H H H H H H H H H H H
charge: 0
multiplicity: 1
keywords: wb97x-d3
keywords: def2-TZVPP
keywords: def2/J RIJCOSX
keywords: DEFGRID2
keywords: scfconv7
keywords: smallprint printgap noloewdin
keywords: NOSOSCF
formula: C16H20N2O3
InChI: InChI=1/C16H20N2O3/c1-9(2)16(4)15(20)17-13(18-16)11-7-6-10(3)8-12(11)14(19)21-5/h6-9,17H,1-5H3
41 atoms
O  -3.015882 1.807924 -0.863307
O  2.720099 2.344215 0.575138
O  0.793061 1.690649 1.490268
N  -1.342567 -0.977966 0.564688
N  -0.945217 0.824134 -0.694845
C  -2.614811 -0.282337 0.404803
C  -3.632921 -1.234419 -0.266781
C  -2.282824 0.927856 -0.46512
C  -3.076386 0.202633 1.777849
C  -5.059775 -0.698124 -0.284648
C  -3.200874 -1.634031 -1.673959
C  -0.459015 -0.300172 -0.046567
C  0.957645 -0.694161 -0.158642
C  2.025243 0.148703 0.168413
C  1.233125 -1.965003 -0.649177
C  3.333106 -0.290201 -0.015884
C  3.611006 -1.56253 -0.503467
C  2.538995 -2.393236 -0.815705
C  1.766259 1.462997 0.813195
C  5.022307 -2.038707 -0.661453
C  2.598684 3.62828 1.190034
H  -3.62297 -2.134307 0.357518
H  -3.948092 0.851062 1.702055
H  -3.332341 -0.647227 2.411531
H  -2.284329 0.766527 2.272955
H  -5.149782 0.222862 -0.861224
H  -5.720436 -1.434184 -0.746013
H  -5.446693 -0.508533 0.716383
H  -3.867281 -2.403847 -2.066261
H  -2.190229 -2.043504 -1.698755
H  -3.243362 -0.792525 -2.369839
H  -0.399799 1.471344 -1.247198
H  0.41516 -2.620595 -0.917756
H  4.159392 0.356682 0.249651
H  2.724157 -3.388981 -1.20046
H  5.731115 -1.211917 -0.642769
H  5.293992 -2.72287 0.145122
H  5.157473 -2.579027 -1.598657
H  1.702631 4.147508 0.850007
H  3.476893 4.188853 0.88191
H  2.583806 3.550625 2.277217
elementType: O N C H
totalener: -957.08188804 hartree
nucrepener: 1722.70805955 hartree
electener: -2679.78994760 hartree
oneelecener: -4724.10357276 hartree
twoeener: 2044.31362516 hartree
cpcmener: -0.03528543 hartree
kineticenergy: 952.89072499 hartree
xcener: -92.376106861365 hartree
chargesum: 0.0000000
charge: -0.462927 -0.276331 -0.443726 -0.378836 -0.091637 0.444195 0.022478 0.157393 -0.342818 -0.308560 -0.305345 0.243207 -0.013057 -0.059276 -0.202972 -0.132144 -0.014133 -0.145268 0.437643 -0.215055 -0.126927 0.044066 0.101036 0.108705 0.112977 0.089256 0.095270 0.094467 0.099823 0.097626 0.090858 0.182170 0.147561 0.136218 0.144059 0.095196 0.108056 0.101796 0.117747 0.127653 0.119557
qa: -0.4629 -0.2763 -0.4437 -0.3788 -0.0916 0.4442 0.0225 0.1574 -0.3428 -0.3086 -0.3053 0.2432 -0.0131 -0.0593 -0.2030 -0.1321 -0.0141 -0.1453 0.4376 -0.2151 -0.1269 0.0441 0.1010 0.1087 0.1130 0.0893 0.0953 0.0945 0.0998 0.0976 0.0909 0.1822 0.1476 0.1362 0.1441 0.0952 0.1081 0.1018 0.1177 0.1277 0.1196
va: 2.0589 2.1388 2.0502 3.0681 3.2259 3.5253 3.8747 4.3186 3.9864 3.9476 3.9361 4.0330 3.6132 3.7785 4.0064 3.9737 3.8196 3.9465 4.1357 3.9054 3.8665 1.0299 1.0040 1.0020 1.0070 1.0151 1.0041 1.0004 1.0037 1.0040 1.0047 1.0074 1.0156 1.0263 0.9992 1.0047 0.9937 0.9984 0.9925 0.9952 0.9933
dispcorr: -0.020268267 hartree
energy: -957.102156308215
dipole: -7.54127 10.50898 2.96771 -6.65243 6.17722 -0.47521 -1.48372 0.77056 -0.71316
magnitude: 3.08897 au
magnitude: 7.85154 debye
