program: Orca
programVersion: 5.0.2
elementType: O O O N N C C C C C C C C C C C C C C C C H H H H H H H H H H H H H H H H H H H H
charge: 0
multiplicity: 1
keywords: wb97x-d3
keywords: def2-TZVPP
keywords: def2/J RIJCOSX
keywords: DEFGRID2
keywords: scfconv7
keywords: smallprint printgap noloewdin
keywords: NOSOSCF
formula: C16H20N2O3
InChI: InChI=1/C16H20N2O3/c1-9(2)16(4)15(20)17-13(18-16)11-7-6-10(3)8-12(11)14(19)21-5/h6-9,17H,1-5H3
41 atoms
O  -3.647244 -1.379036 1.439275
O  1.600843 1.57914 -1.708211
O  1.003255 2.212058 0.351075
N  -1.02231 -0.063108 -0.544169
N  -1.351765 -1.356339 1.250157
C  -2.462618 -0.18819 -0.372795
C  -3.150251 1.182591 -0.200623
C  -2.62612 -1.037783 0.884608
C  -3.037008 -0.979535 -1.550707
C  -2.650594 1.932819 1.029645
C  -3.001985 2.051718 -1.443316
C  -0.466756 -0.743423 0.377184
C  0.980947 -0.935212 0.500807
C  1.870387 0.025658 0.011789
C  1.497149 -2.121156 1.010897
C  3.234107 -0.217634 0.023918
C  3.754779 -1.405113 0.536934
C  2.863841 -2.349447 1.032916
C  1.411718 1.380191 -0.418614
C  5.231471 -1.651423 0.529418
C  1.292504 2.877768 -2.221642
H  -4.214585 0.967255 -0.057328
H  -2.796342 -0.495205 -2.495384
H  -2.626428 -1.989731 -1.585353
H  -4.121633 -1.057196 -1.469033
H  -2.793709 1.372776 1.955592
H  -1.593042 2.184775 0.94842
H  -3.198718 2.869501 1.142424
H  -3.472198 1.61117 -2.322368
H  -1.952417 2.235934 -1.678124
H  -3.476846 3.020299 -1.279853
H  -1.103019 -1.884337 2.075329
H  0.833048 -2.895679 1.373268
H  3.914463 0.538626 -0.351228
H  3.2378 -3.282726 1.435044
H  5.501778 -2.48919 1.170644
H  5.581647 -1.881555 -0.47903
H  5.784454 -0.774264 0.866589
H  1.916111 3.645334 -1.762873
H  0.241624 3.125209 -2.071535
H  1.502021 2.834311 -3.286582
elementType: O N C H
totalener: -957.08248839 hartree
nucrepener: 1748.52255400 hartree
electener: -2705.60504239 hartree
oneelecener: -4775.89179612 hartree
twoeener: 2070.28675373 hartree
cpcmener: -0.03643595 hartree
kineticenergy: 952.89581121 hartree
xcener: -92.378600771980 hartree
chargesum: -0.0000000
charge: -0.455970 -0.269432 -0.443503 -0.419133 -0.108588 0.385562 0.051525 0.174281 -0.341282 -0.312269 -0.307870 0.359661 -0.070550 -0.077675 -0.152966 -0.125333 -0.028302 -0.147538 0.429309 -0.212751 -0.134438 0.045782 0.106103 0.115711 0.107993 0.097215 0.089185 0.099693 0.097757 0.079357 0.095736 0.181164 0.137129 0.136128 0.143436 0.095008 0.108500 0.103239 0.123282 0.115128 0.129718
qa: -0.4560 -0.2694 -0.4435 -0.4191 -0.1086 0.3856 0.0515 0.1743 -0.3413 -0.3123 -0.3079 0.3597 -0.0706 -0.0777 -0.1530 -0.1253 -0.0283 -0.1475 0.4293 -0.2128 -0.1344 0.0458 0.1061 0.1157 0.1080 0.0972 0.0892 0.0997 0.0978 0.0794 0.0957 0.1812 0.1371 0.1361 0.1434 0.0950 0.1085 0.1032 0.1233 0.1151 0.1297
va: 2.0761 2.1207 2.0527 3.0387 3.2519 3.5879 3.8102 4.2988 3.9875 3.9419 3.9652 3.9401 3.6848 3.8137 3.9515 3.9569 3.8187 3.9379 4.2085 3.9067 3.8705 1.0320 1.0021 0.9995 1.0071 1.0090 1.0127 1.0048 1.0006 1.0021 1.0051 1.0102 1.0124 1.0109 1.0010 1.0043 0.9938 0.9981 0.9944 0.9812 0.9950
dispcorr: -0.021227789 hartree
energy: -957.103716181362
dipole: -2.95997 5.31049 2.35052 7.19262 -8.01534 -0.82272 -7.38164 6.75523 -0.62641
magnitude: 2.56792 au
magnitude: 6.52713 debye
