program: Orca
programVersion: 5.0.2
elementType: O O O N N C C C C C C C C C C C C C C C C H H H H H H H H H H H H H H H H H H H H
charge: 0
multiplicity: 1
keywords: wb97x-d3
keywords: def2-TZVPP
keywords: def2/J RIJCOSX
keywords: DEFGRID2
keywords: scfconv7
keywords: smallprint printgap noloewdin
keywords: NOSOSCF
formula: C16H20N2O3
InChI: InChI=1/C16H20N2O3/c1-9(2)16(4)15(20)17-13(18-16)11-7-6-10(3)8-12(11)14(19)21-5/h6-9,17H,1-5H3
41 atoms
O  -3.664498 -1.55173 1.182934
O  1.574215 1.547034 -1.713235
O  1.009242 2.214914 0.355343
N  -1.001101 0.026275 -0.537821
N  -1.366547 -1.491051 1.062135
C  -2.443758 -0.102775 -0.403633
C  -3.111167 1.236942 -0.017683
C  -2.632759 -1.129053 0.710013
C  -3.020888 -0.687698 -1.694078
C  -2.624459 1.763481 1.328806
C  -2.925825 2.300791 -1.093059
C  -0.462779 -0.770367 0.296472
C  0.9820 -0.963282 0.440399
C  1.874146 0.027552 0.019584
C  1.499181 -2.16152 0.921834
C  3.240112 -0.193448 0.080004
C  3.76039 -1.389803 0.571728
C  2.866935 -2.369147 0.989644
C  1.405242 1.37934 -0.415897
C  5.240759 -1.593062 0.663497
C  1.208094 2.789114 -2.319809
H  -4.181293 1.020319 0.06969
H  -4.106866 -0.762942 -1.63021
H  -2.768689 -0.062976 -2.549131
H  -2.621403 -1.68481 -1.885856
H  -2.808246 1.067508 2.149345
H  -1.558512 1.993319 1.312564
H  -3.149814 2.686635 1.57865
H  -1.870779 2.530554 -1.251118
H  -3.419719 3.225298 -0.789623
H  -3.35665 2.011124 -2.051562
H  -1.141162 -2.130715 1.811237
H  0.837582 -2.962723 1.225565
H  3.921262 0.584291 -0.246724
H  3.240649 -3.313639 1.364939
H  5.650578 -1.067321 1.528622
H  5.495431 -2.646715 0.770138
H  5.753035 -1.20721 -0.217936
H  1.034292 3.576907 -1.590751
H  0.306476 2.635577 -2.91176
H  2.023394 3.08103 -2.978431
elementType: O N C H
totalener: -957.08098029 hartree
nucrepener: 1751.00085017 hartree
electener: -2708.08183046 hartree
oneelecener: -4780.90371928 hartree
twoeener: 2072.82188882 hartree
cpcmener: -0.03587851 hartree
kineticenergy: 952.89377875 hartree
xcener: -92.380016344590 hartree
chargesum: -0.0000000
charge: -0.456074 -0.266583 -0.439615 -0.411001 -0.108187 0.372941 0.050300 0.175145 -0.337306 -0.311757 -0.303559 0.361188 -0.061341 -0.098813 -0.157391 -0.114168 -0.027492 -0.148655 0.417314 -0.212491 -0.112771 0.047291 0.107443 0.105678 0.115692 0.098252 0.088518 0.099841 0.072542 0.098178 0.096070 0.179468 0.135906 0.136588 0.143094 0.108757 0.095459 0.102435 0.109723 0.116063 0.133318
qa: -0.4561 -0.2666 -0.4396 -0.4110 -0.1082 0.3729 0.0503 0.1751 -0.3373 -0.3118 -0.3036 0.3612 -0.0613 -0.0988 -0.1574 -0.1142 -0.0275 -0.1487 0.4173 -0.2125 -0.1128 0.0473 0.1074 0.1057 0.1157 0.0983 0.0885 0.0998 0.0725 0.0982 0.0961 0.1795 0.1359 0.1366 0.1431 0.1088 0.0955 0.1024 0.1097 0.1161 0.1333
va: 2.0760 2.1304 2.0614 3.0297 3.2527 3.5994 3.8072 4.2969 3.9826 3.9382 3.9623 3.9387 3.6746 3.8090 3.9586 3.9440 3.8134 3.9337 4.2491 3.9069 3.8297 1.0313 1.0073 1.0023 0.9998 1.0083 1.0133 1.0047 1.0076 1.0058 0.9999 1.0118 1.0114 1.0101 1.0010 0.9938 1.0036 0.9988 1.0124 0.9889 0.9920
dispcorr: -0.021321675 hartree
energy: -957.102301964780
dipole: -2.91508 5.20596 2.29088 7.99561 -8.79332 -0.79771 -5.84671 5.23756 -0.60914
magnitude: 2.50111 au
magnitude: 6.35731 debye
