program: Orca
programVersion: 5.0.2
elementType: O O O N N C C C C C C C C C C C C C C C C H H H H H H H H H H H H H H H H H H H H
charge: 0
multiplicity: 1
keywords: wb97x-d3
keywords: def2-TZVPP
keywords: def2/J RIJCOSX
keywords: DEFGRID2
keywords: scfconv7
keywords: smallprint printgap noloewdin
keywords: NOSOSCF
formula: C16H20N2O3
InChI: InChI=1/C16H20N2O3/c1-9(2)16(4)15(20)17-13(18-16)11-7-6-10(3)8-12(11)14(19)21-5/h6-9,17H,1-5H3
41 atoms
O  -3.684896 -1.642404 1.027329
O  1.611102 1.538369 -1.726587
O  0.982978 2.224591 0.308725
N  -1.000653 0.055164 -0.538178
N  -1.385823 -1.560723 0.956586
C  -2.443957 -0.079935 -0.429968
C  -3.110044 1.226775 0.063197
C  -2.647179 -1.183471 0.603715
C  -3.015233 -0.553306 -1.766821
C  -2.613165 1.651303 1.441566
C  -2.940805 2.371589 -0.927274
C  -0.471966 -0.788774 0.255108
C  0.971348 -0.974751 0.420465
C  1.862969 0.026585 0.021261
C  1.492679 -2.164866 0.917005
C  3.228832 -0.179204 0.11067
C  3.752618 -1.370877 0.610689
C  2.861576 -2.356978 1.015148
C  1.401651 1.374514 -0.433668
C  5.234303 -1.570534 0.684321
C  1.262037 2.802277 -2.29213
H  -4.178694 0.999881 0.142876
H  -2.753348 0.1379 -2.56601
H  -2.620242 -1.533855 -2.037134
H  -4.102083 -0.626406 -1.716454
H  -3.149778 2.542479 1.77078
H  -2.773876 0.889288 2.206569
H  -1.551253 1.900338 1.430988
H  -3.44403 3.263992 -0.551104
H  -3.371726 2.15142 -1.904108
H  -1.88917 2.626023 -1.070155
H  -1.173419 -2.242365 1.671345
H  0.836868 -2.972666 1.215412
H  3.908064 0.60546 -0.203412
H  3.237734 -3.294368 1.405403
H  5.492324 -2.472159 1.237833
H  5.664617 -1.66042 -0.3152
H  5.725178 -0.724872 1.167401
H  1.811121 3.616201 -1.821596
H  0.191031 2.987645 -2.210029
H  1.535618 2.744391 -3.341612
elementType: O N C H
totalener: -957.08262031 hartree
nucrepener: 1751.25015463 hartree
electener: -2708.33277494 hartree
oneelecener: -4781.37918517 hartree
twoeener: 2073.04641023 hartree
cpcmener: -0.03650359 hartree
kineticenergy: 952.89996428 hartree
xcener: -92.380911385256 hartree
chargesum: 0.0000000
charge: -0.456180 -0.269007 -0.442794 -0.405772 -0.108099 0.371378 0.046936 0.174271 -0.334389 -0.309673 -0.305893 0.346861 -0.059678 -0.080321 -0.152298 -0.119640 -0.034710 -0.142126 0.434087 -0.213609 -0.136651 0.047990 0.105274 0.114402 0.107137 0.100881 0.097614 0.087095 0.099036 0.096360 0.073044 0.178161 0.134600 0.136236 0.143403 0.093776 0.108694 0.104559 0.117195 0.121175 0.130672
qa: -0.4562 -0.2690 -0.4428 -0.4058 -0.1081 0.3714 0.0469 0.1743 -0.3344 -0.3097 -0.3059 0.3469 -0.0597 -0.0803 -0.1523 -0.1196 -0.0347 -0.1421 0.4341 -0.2136 -0.1367 0.0480 0.1053 0.1144 0.1071 0.1009 0.0976 0.0871 0.0990 0.0964 0.0730 0.1782 0.1346 0.1362 0.1434 0.0938 0.1087 0.1046 0.1172 0.1212 0.1307
va: 2.0757 2.1213 2.0536 3.0327 3.2540 3.6013 3.8073 4.2948 3.9796 3.9377 3.9605 3.9671 3.6780 3.8132 3.9594 3.9527 3.8275 3.9237 4.2145 3.9086 3.8823 1.0320 1.0019 1.0004 1.0072 1.0045 1.0079 1.0141 1.0061 0.9999 1.0090 1.0131 1.0105 1.0101 1.0011 1.0052 0.9939 0.9971 0.9943 0.9769 0.9950
dispcorr: -0.021320646 hartree
energy: -957.103940957031
dipole: -2.76409 5.09311 2.32902 8.36973 -9.18817 -0.81843 -4.99594 4.45153 -0.54442
magnitude: 2.52796 au
magnitude: 6.42556 debye
