program: Orca
programVersion: 5.0.2
elementType: O O O N N C C C C C C C C C C C C C C C C H H H H H H H H H H H H H H H H H H H H
charge: 0
multiplicity: 1
keywords: wb97x-d3
keywords: def2-TZVPP
keywords: def2/J RIJCOSX
keywords: DEFGRID2
keywords: scfconv7
keywords: smallprint printgap noloewdin
keywords: NOSOSCF
formula: C16H20N2O3
InChI: InChI=1/C16H20N2O3/c1-9(2)16(4)15(20)17-13(18-16)11-7-6-10(3)8-12(11)14(19)21-5/h6-9,17H,1-5H3
41 atoms
O  -2.955265 1.118089 1.667264
O  0.916485 1.844449 -0.779186
O  2.378623 2.338146 0.838382
N  -1.2672 -1.160638 -0.463536
N  -0.85458 0.380055 1.100693
C  -2.558525 -0.622915 -0.050674
C  -3.275469 -0.021972 -1.283519
C  -2.21453 0.420948 1.008883
C  -3.368779 -1.742111 0.602329
C  -4.709707 0.418499 -1.012818
C  -2.484418 1.122215 -1.909365
C  -0.368538 -0.569629 0.214305
C  1.065966 -0.890434 0.142922
C  2.080783 0.070789 0.177018
C  1.424348 -2.234274 0.101748
C  3.412606 -0.324859 0.204434
C  3.772279 -1.667055 0.156795
C  2.754263 -2.615256 0.1000
C  1.814374 1.535365 0.137848
C  5.211474 -2.078888 0.136994
C  0.525983 3.214876 -0.891837
H  -3.309915 -0.842785 -2.007917
H  -4.285705 -1.363199 1.051187
H  -3.634444 -2.4944 -0.140896
H  -2.79285 -2.232425 1.388192
H  -4.763793 1.239851 -0.297696
H  -5.161315 0.770331 -1.941942
H  -5.336944 -0.392427 -0.643457
H  -2.965651 1.445967 -2.833595
H  -1.466482 0.828333 -2.164575
H  -2.437743 1.993853 -1.25158
H  -0.317948 0.887507 1.790924
H  0.649056 -2.988944 0.091735
H  4.189133 0.430182 0.235094
H  3.002162 -3.669267 0.067745
H  5.371539 -2.997766 0.700797
H  5.54556 -2.266741 -0.885738
H  5.857038 -1.306984 0.554153
H  1.38636 3.862753 -1.054382
H  -0.015456 3.542804 -0.00442
H  -0.129614 3.26953 -1.755413
elementType: O N C H
totalener: -957.08163778 hartree
nucrepener: 1747.48312974 hartree
electener: -2704.56476752 hartree
oneelecener: -4772.82164949 hartree
twoeener: 2068.25688198 hartree
cpcmener: -0.03265792 hartree
kineticenergy: 952.89398279 hartree
xcener: -92.375776321081 hartree
chargesum: 0.0000000
charge: -0.459279 -0.258124 -0.440744 -0.400309 -0.093411 0.433284 0.032226 0.164352 -0.336954 -0.306695 -0.327082 0.290718 -0.011255 -0.077797 -0.198995 -0.116703 -0.019987 -0.141123 0.394717 -0.212633 -0.138293 0.045639 0.102698 0.109708 0.114340 0.088060 0.096128 0.094772 0.105145 0.097079 0.086796 0.177537 0.139682 0.133929 0.143883 0.100276 0.107848 0.097324 0.130290 0.127939 0.125014
qa: -0.4593 -0.2581 -0.4407 -0.4003 -0.0934 0.4333 0.0322 0.1644 -0.3370 -0.3067 -0.3271 0.2907 -0.0113 -0.0778 -0.1990 -0.1167 -0.0200 -0.1411 0.3947 -0.2126 -0.1383 0.0456 0.1027 0.1097 0.1143 0.0881 0.0961 0.0948 0.1051 0.0971 0.0868 0.1775 0.1397 0.1339 0.1439 0.1003 0.1078 0.0973 0.1303 0.1279 0.1250
va: 2.0615 2.1226 2.0627 3.0473 3.2404 3.5501 3.8688 4.3052 3.9783 3.9501 3.9347 3.9063 3.6191 3.8204 4.0103 3.9525 3.8290 3.9365 4.1821 3.9049 3.8480 1.0287 1.0043 1.0032 1.0010 1.0139 1.0038 1.0008 1.0062 1.0142 1.0001 1.0121 1.0290 1.0197 0.9996 0.9998 0.9938 1.0034 0.9985 0.9915 0.9915
dispcorr: -0.021745062 hartree
energy: -957.103382844770
dipole: -10.10008 11.43416 1.33408 -2.04815 1.14299 -0.90516 -8.59936 7.81346 -0.78591
magnitude: 1.79353 au
magnitude: 4.55879 debye
