program: Orca
programVersion: 5.0.2
elementType: O O O N N C C C C C C C C C C C C C C C C H H H H H H H H H H H H H H H H H H H H
charge: 0
multiplicity: 1
keywords: wb97x-d3
keywords: def2-TZVPP
keywords: def2/J RIJCOSX
keywords: DEFGRID2
keywords: scfconv7
keywords: smallprint printgap noloewdin
keywords: NOSOSCF
formula: C16H20N2O3
InChI: InChI=1/C16H20N2O3/c1-9(2)16(4)15(20)17-13(18-16)11-7-6-10(3)8-12(11)14(19)21-5/h6-9,17H,1-5H3
41 atoms
O  -2.8173 2.106277 -0.886136
O  1.017855 1.589738 1.542624
O  2.713182 2.441329 0.360372
N  -1.336364 -0.826856 0.446743
N  -0.792448 1.027543 -0.680882
C  -2.555781 -0.046426 0.298117
C  -3.637786 -0.833102 -0.473271
C  -2.133271 1.18315 -0.501307
C  -3.034154 0.41622 1.674026
C  -3.154588 -1.266002 -1.853875
C  -4.139222 -2.040752 0.30931
C  -0.397343 -0.172703 -0.105881
C  0.994011 -0.643162 -0.215174
C  2.105888 0.157013 0.068147
C  1.204503 -1.936203 -0.680976
C  3.387655 -0.332712 -0.151933
C  3.600729 -1.626416 -0.616317
C  2.487066 -2.421565 -0.870798
C  1.987188 1.522346 0.647846
C  4.987902 -2.156996 -0.806929
C  0.721392 2.866241 2.110312
H  -4.47526 -0.139798 -0.606274
H  -3.973574 0.964041 1.593157
H  -3.185762 -0.434171 2.336571
H  -2.299148 1.072008 2.144368
H  -2.807611 -0.431435 -2.466244
H  -2.343247 -1.992995 -1.786116
H  -3.969033 -1.740516 -2.403171
H  -3.330222 -2.738462 0.532178
H  -4.886252 -2.580291 -0.275328
H  -4.613081 -1.76328 1.250901
H  -0.206857 1.64494 -1.227213
H  0.35354 -2.561479 -0.917047
H  4.240392 0.298511 0.067306
H  2.620801 -3.432568 -1.236258
H  5.326158 -2.685191 0.087275
H  5.035003 -2.863402 -1.63533
H  5.701546 -1.357149 -1.001249
H  1.582782 3.280977 2.633382
H  -0.081685 2.697745 2.821777
H  0.386108 3.568503 1.346666
elementType: O N C H
totalener: -957.08249142 hartree
nucrepener: 1742.32516277 hartree
electener: -2699.40765419 hartree
oneelecener: -4762.44102534 hartree
twoeener: 2063.03337114 hartree
cpcmener: -0.03419617 hartree
kineticenergy: 952.89584541 hartree
xcener: -92.376865704022 hartree
chargesum: 0.0000000
charge: -0.458994 -0.263429 -0.444599 -0.410684 -0.084780 0.445506 0.049037 0.145646 -0.346735 -0.305457 -0.315986 0.250445 -0.005555 -0.063170 -0.204276 -0.114673 -0.015448 -0.148214 0.410826 -0.212340 -0.136992 0.048011 0.108892 0.105737 0.112313 0.097641 0.084415 0.102541 0.085600 0.095289 0.096041 0.183625 0.149168 0.131855 0.143703 0.107929 0.099128 0.098010 0.128258 0.127121 0.124594
qa: -0.4590 -0.2634 -0.4446 -0.4107 -0.0848 0.4455 0.0490 0.1456 -0.3467 -0.3055 -0.3160 0.2504 -0.0056 -0.0632 -0.2043 -0.1147 -0.0154 -0.1482 0.4108 -0.2123 -0.1370 0.0480 0.1089 0.1057 0.1123 0.0976 0.0844 0.1025 0.0856 0.0953 0.0960 0.1836 0.1492 0.1319 0.1437 0.1079 0.0991 0.0980 0.1283 0.1271 0.1246
va: 2.0739 2.1218 2.0629 3.0780 3.1966 3.4862 3.8222 4.3095 4.0010 3.9448 3.9473 4.0426 3.5560 3.7920 4.0151 3.9532 3.8234 3.9500 4.1573 3.9043 3.8522 1.0324 1.0072 1.0017 0.9998 1.0073 1.0034 1.0045 1.0154 1.0042 0.9992 1.0069 1.0142 1.0228 0.9998 0.9938 1.0006 1.0023 0.9962 0.9934 0.9916
dispcorr: -0.021241540 hartree
energy: -957.103732963572
dipole: -10.43774 11.57987 1.14213 -10.51877 9.29604 -1.22273 1.18080 -1.01099 0.16981
magnitude: 1.68178 au
magnitude: 4.27474 debye
