program: Orca
programVersion: 5.0.2
elementType: O O O N N C C C C C C C C C C C C C C C C H H H H H H H H H H H H H H H H H H H H
charge: 0
multiplicity: 1
keywords: wb97x-d3
keywords: def2-TZVPP
keywords: def2/J RIJCOSX
keywords: DEFGRID2
keywords: scfconv7
keywords: smallprint printgap noloewdin
keywords: NOSOSCF
formula: C16H20N2O3
InChI: InChI=1/C16H20N2O3/c1-9(2)16(4)15(20)17-13(18-16)11-7-6-10(3)8-12(11)14(19)21-5/h6-9,17H,1-5H3
41 atoms
O  -3.09995 1.028269 1.923576
O  2.634386 2.42454 0.084495
O  0.513877 2.032696 -0.484957
N  -1.422313 -1.107159 -0.358504
N  -0.991824 0.363773 1.269392
C  -2.707114 -0.667075 0.163917
C  -3.576126 -0.035598 -0.943563
C  -2.364087 0.370514 1.235875
C  -3.3983 -1.847273 0.849183
C  -2.890837 1.165929 -1.587694
C  -3.964518 -1.053702 -2.010717
C  -0.518672 -0.487634 0.283692
C  0.921786 -0.771189 0.117037
C  1.934341 0.188522 0.008241
C  1.279064 -2.115786 0.113582
C  3.264863 -0.219932 -0.060241
C  3.621216 -1.560443 -0.045935
C  2.602636 -2.504524 0.031232
C  1.595977 1.627686 -0.155958
C  5.056803 -1.98352 -0.138496
C  2.427433 3.818245 -0.108178
H  -4.48604 0.317043 -0.446081
H  -4.378975 -1.553007 1.222976
H  -3.517779 -2.676164 0.154483
H  -2.810178 -2.20784 1.694107
H  -2.64975 1.948081 -0.867607
H  -1.966261 0.876581 -2.087492
H  -3.547388 1.611737 -2.335968
H  -3.078898 -1.496758 -2.466683
H  -4.540666 -0.568613 -2.79975
H  -4.582056 -1.86043 -1.616335
H  -0.441371 0.978884 1.843312
H  0.496791 -2.85886 0.18374
H  4.043629 0.525451 -0.147691
H  2.846455 -3.560171 0.0337
H  5.268546 -2.443578 -1.105112
H  5.733791 -1.138826 -0.021661
H  5.305499 -2.716576 0.629236
H  2.148401 4.043833 -1.137431
H  3.375305 4.294954 0.125361
H  1.653052 4.203852 0.555123
totalener: -957.05676824 hartree
nucrepener: 1728.15221359 hartree
electener: -2685.20898182 hartree
oneelecener: -4734.51189293 hartree
twoeener: 2049.30291111 hartree
kineticenergy: 952.95439956 hartree
xcener: -92.380831384913 hartree
chargesum: -0.0000000
charge: -0.342095 -0.267211 -0.357510 -0.388746 -0.124735 0.411130 0.026974 0.120322 -0.335133 -0.278114 -0.294601 0.281128 0.014583 -0.116095 -0.161412 -0.107679 -0.005352 -0.112865 0.376245 -0.216912 -0.126698 0.048895 0.108852 0.099574 0.096661 0.096444 0.083019 0.084726 0.094817 0.081192 0.079582 0.144624 0.125757 0.117978 0.119423 0.104321 0.082682 0.096668 0.113746 0.116154 0.109662
qa: -0.3421 -0.2672 -0.3575 -0.3887 -0.1247 0.4111 0.0270 0.1203 -0.3351 -0.2781 -0.2946 0.2811 0.0146 -0.1161 -0.1614 -0.1077 -0.0054 -0.1129 0.3762 -0.2169 -0.1267 0.0489 0.1089 0.0996 0.0967 0.0964 0.0830 0.0847 0.0948 0.0812 0.0796 0.1446 0.1258 0.1180 0.1194 0.1043 0.0827 0.0967 0.1137 0.1162 0.1097
va: 2.1950 2.1246 2.1275 3.0203 3.2212 3.5395 3.8693 4.3294 3.9859 3.9435 3.9387 3.9229 3.7168 3.8528 4.0283 3.9854 3.8329 3.9587 4.1793 3.9151 3.8934 1.0308 1.0088 1.0043 1.0041 1.0129 1.0177 1.0041 1.0162 1.0079 1.0026 1.0353 1.0338 1.0362 1.0052 0.9938 1.0086 0.9985 0.9954 0.9944 0.9950
dispcorr: -0.020177436 hartree
energy: -957.076945672236
dipole: -4.90431 7.23187 2.32756 -3.94261 3.70710 -0.23551 -8.12696 8.07033 -0.05664
magnitude: 2.34013 au
magnitude: 5.94814 debye
