program: Orca
programVersion: 5.0.2
elementType: O O O N N C C C C C C C C C C C C C C C C H H H H H H H H H H H H H H H H H H H H
charge: 0
multiplicity: 1
keywords: wb97x-d3
keywords: def2-TZVPP
keywords: def2/J RIJCOSX
keywords: DEFGRID2
keywords: scfconv7
keywords: smallprint printgap noloewdin
keywords: NOSOSCF
formula: C16H20N2O3
InChI: InChI=1/C16H20N2O3/c1-9(2)16(4)15(20)17-13(18-16)11-7-6-10(3)8-12(11)14(19)21-5/h6-9,17H,1-5H3
41 atoms
O  -3.204204 1.328924 1.352983
O  2.575153 2.313657 -0.642199
O  1.128111 2.224524 1.039674
N  -1.367587 -1.284408 -0.180674
N  -1.052987 0.615974 0.94726
C  -2.689004 -0.757546 0.123251
C  -3.448831 -0.514821 -1.203229
C  -2.422176 0.541677 0.885263
C  -3.419196 -1.741353 1.03657
C  -4.918024 -0.154095 -1.006632
C  -2.75879 0.532353 -2.073181
C  -0.508346 -0.475092 0.301616
C  0.943371 -0.749224 0.193368
C  1.989804 0.184638 0.104274
C  1.270186 -2.099828 0.078498
C  3.294453 -0.263833 -0.094439
C  3.614197 -1.61129 -0.176373
C  2.57304 -2.525537 -0.089551
C  1.820219 1.661455 0.228319
C  5.038001 -2.049337 -0.345334
C  2.553532 3.736548 -0.579741
H  -3.397478 -1.473741 -1.73016
H  -4.345827 -1.313214 1.41483
H  -3.649288 -2.658158 0.493153
H  -2.799517 -2.006152 1.893513
H  -5.03654 0.760532 -0.427027
H  -5.389979 0.003673 -1.97757
H  -5.476212 -0.944739 -0.506319
H  -3.242515 0.586669 -3.049261
H  -1.709624 0.293233 -2.245033
H  -2.820548 1.528634 -1.630543
H  -0.518232 1.359487 1.375313
H  0.466658 -2.821481 0.113814
H  4.093077 0.461564 -0.17977
H  2.77883 -3.586471 -0.160438
H  5.103272 -3.095601 -0.639788
H  5.550223 -1.457586 -1.104105
H  5.596045 -1.935648 0.585695
H  2.91649 4.101049 0.381231
H  1.550046 4.126728 -0.747129
H  3.213445 4.076404 -1.372554
totalener: -957.05857732 hartree
nucrepener: 1716.64788388 hartree
electener: -2673.70646119 hartree
oneelecener: -4711.25568334 hartree
twoeener: 2037.54922215 hartree
kineticenergy: 952.94412498 hartree
xcener: -92.383281239560 hartree
chargesum: 0.0000000
charge: -0.352349 -0.258123 -0.395247 -0.360200 -0.149748 0.388373 0.020189 0.126739 -0.322952 -0.280170 -0.299185 0.280063 -0.077747 -0.041159 -0.128210 -0.114808 -0.002335 -0.122939 0.388651 -0.215193 -0.128264 0.041761 0.102243 0.099042 0.098069 0.103891 0.079951 0.078273 0.086702 0.094090 0.088411 0.190880 0.124989 0.106161 0.115251 0.084862 0.095433 0.104502 0.113293 0.115961 0.120848
qa: -0.3523 -0.2581 -0.3952 -0.3602 -0.1497 0.3884 0.0202 0.1267 -0.3230 -0.2802 -0.2992 0.2801 -0.0777 -0.0412 -0.1282 -0.1148 -0.0023 -0.1229 0.3887 -0.2152 -0.1283 0.0418 0.1022 0.0990 0.0981 0.1039 0.0800 0.0783 0.0867 0.0941 0.0884 0.1909 0.1250 0.1062 0.1153 0.0849 0.0954 0.1045 0.1133 0.1160 0.1208
va: 2.1667 2.1412 2.0895 2.9943 3.2265 3.6170 3.8936 4.3205 3.9801 3.9417 3.9387 3.9807 3.8223 3.8145 4.0142 3.9840 3.8483 3.9815 4.1731 3.9163 3.8795 1.0284 1.0058 1.0046 1.0075 1.0153 1.0066 1.0045 1.0064 1.0121 1.0065 1.0493 1.0505 1.0338 1.0084 1.0072 0.9996 0.9929 0.9956 0.9964 0.9941
dispcorr: -0.019500516 hartree
energy: -957.078077830804
dipole: -6.82236 9.04483 2.22248 -3.99015 3.73286 -0.25729 -8.74504 8.05175 -0.69330
magnitude: 2.34228 au
magnitude: 5.95359 debye
