program: Orca
programVersion: 5.0.2
elementType: O O O N N C C C C C C C C C C C C C C C C H H H H H H H H H H H H H H H H H H H H
charge: 0
multiplicity: 1
keywords: wb97x-d3
keywords: def2-TZVPP
keywords: def2/J RIJCOSX
keywords: DEFGRID2
keywords: scfconv7
keywords: smallprint printgap noloewdin
keywords: NOSOSCF
formula: C16H20N2O3
InChI: InChI=1/C16H20N2O3/c1-9(2)16(4)15(20)17-13(18-16)11-7-6-10(3)8-12(11)14(19)21-5/h6-9,17H,1-5H3
41 atoms
O  -3.65422 -1.688973 -0.819617
O  1.823301 2.273299 -0.304007
O  1.085602 1.141654 -2.090525
N  -0.984779 0.470333 0.065082
N  -1.389168 -1.685662 -0.378973
C  -2.399377 0.367808 -0.253154
C  -3.272326 0.850992 0.923219
C  -2.637207 -1.121063 -0.523869
C  -2.675291 1.134228 -1.548105
C  -3.014075 0.039183 2.189956
C  -3.073706 2.336843 1.202321
C  -0.482023 -0.689643 -0.051489
C  0.937445 -0.991343 0.154434
C  1.905934 -0.054254 -0.204416
C  1.337828 -2.169905 0.772307
C  3.240184 -0.300154 0.075715
C  3.648957 -1.484374 0.68211
C  2.676108 -2.414647 1.028339
C  1.532671 1.169708 -0.979117
C  5.102877 -1.755722 0.92733
C  1.454243 3.501322 -0.917402
H  -4.310744 0.684538 0.617728
H  -2.392157 2.179251 -1.439374
H  -2.092129 0.726688 -2.374076
H  -3.732039 1.07706 -1.809153
H  -1.983433 0.153258 2.528792
H  -3.663841 0.382732 2.995645
H  -3.215496 -1.024334 2.053486
H  -3.661388 2.638588 2.070723
H  -3.391707 2.96364 0.369196
H  -2.02624 2.556102 1.41306
H  -1.166448 -2.63773 -0.616856
H  0.59753 -2.892847 1.09254
H  3.985631 0.43648 -0.199394
H  2.964711 -3.33762 1.515812
H  5.558006 -2.241527 0.061946
H  5.657839 -0.836668 1.111841
H  5.250561 -2.412413 1.783769
H  1.973232 3.655207 -1.863878
H  1.734886 4.282581 -0.216451
H  0.379087 3.540303 -1.094974
totalener: -957.05587129 hartree
nucrepener: 1744.98288506 hartree
electener: -2702.03875635 hartree
oneelecener: -4768.02884175 hartree
twoeener: 2065.99008540 hartree
kineticenergy: 952.95917415 hartree
xcener: -92.380308099409 hartree
chargesum: -0.0000000
charge: -0.332965 -0.254531 -0.347666 -0.407768 -0.142235 0.388149 0.061993 0.114644 -0.331374 -0.301028 -0.299864 0.392440 -0.103950 -0.036836 -0.168249 -0.089516 -0.014187 -0.128518 0.346502 -0.215275 -0.134538 0.052270 0.089084 0.113923 0.112469 0.086058 0.088335 0.092666 0.082963 0.083130 0.093915 0.147493 0.121989 0.107537 0.114287 0.105357 0.090252 0.087641 0.111337 0.117217 0.106851
qa: -0.3330 -0.2545 -0.3477 -0.4078 -0.1422 0.3881 0.0620 0.1146 -0.3314 -0.3010 -0.2999 0.3924 -0.1039 -0.0368 -0.1682 -0.0895 -0.0142 -0.1285 0.3465 -0.2153 -0.1345 0.0523 0.0891 0.1139 0.1125 0.0861 0.0883 0.0927 0.0830 0.0831 0.0939 0.1475 0.1220 0.1075 0.1143 0.1054 0.0903 0.0876 0.1113 0.1172 0.1069
va: 2.1999 2.1262 2.1573 2.9968 3.2190 3.5996 3.8026 4.3214 3.9846 3.9523 3.9490 3.8163 3.7598 3.8788 3.9995 3.9698 3.8456 4.0131 4.2650 3.9166 3.9052 1.0311 1.0044 1.0057 1.0092 1.0098 1.0076 1.0078 1.0089 1.0019 1.0126 1.0340 1.0203 1.0207 1.0095 0.9922 1.0040 1.0042 0.9956 0.9951 0.9932
dispcorr: -0.020874435 hartree
energy: -957.076745728226
dipole: -3.51566 5.17776 1.66211 9.19778 -9.24801 -0.05024 7.84673 -7.07566 0.77107
magnitude: 1.83294 au
magnitude: 4.65897 debye
