program: Orca
programVersion: 5.0.2
elementType: O O O N N C C C C C C C C C C C C C C C C H H H H H H H H H H H H H H H H H H H H
charge: 0
multiplicity: 1
keywords: wb97x-d3
keywords: def2-TZVPP
keywords: def2/J RIJCOSX
keywords: DEFGRID2
keywords: scfconv7
keywords: smallprint printgap noloewdin
keywords: NOSOSCF
formula: C16H20N2O3
InChI: InChI=1/C16H20N2O3/c1-9(2)16(4)15(20)17-13(18-16)11-7-6-10(3)8-12(11)14(19)21-5/h6-9,17H,1-5H3
41 atoms
O  -3.37348 -0.134666 -2.056597
O  2.322055 2.159527 1.157743
O  0.939813 2.17028 -0.598793
N  -1.043368 0.139687 0.610915
N  -1.191608 -0.607881 -1.49412
C  -2.414126 0.379324 0.174791
C  -3.38309 -0.377248 1.111929
C  -2.466199 -0.139567 -1.266838
C  -2.660655 1.887909 0.171866
C  -4.850838 -0.037704 0.872375
C  -3.169102 -1.887216 1.055997
C  -0.422108 -0.375173 -0.366041
C  0.995213 -0.769433 -0.336872
C  1.988969 0.134891 0.036328
C  1.343717 -2.08883 -0.592103
C  3.298341 -0.303405 0.181678
C  3.65436 -1.623406 -0.073736
C  2.657459 -2.508571 -0.467286
C  1.667133 1.585544 0.155682
C  5.081292 -2.069924 0.042846
C  2.109441 3.553586 1.338652
H  -3.113154 -0.039074 2.118178
H  -3.612759 2.130898 -0.296614
H  -2.664879 2.262625 1.195773
H  -1.870066 2.404618 -0.371169
H  -5.167357 -0.288037 -0.13967
H  -5.476468 -0.603164 1.564548
H  -5.063841 1.017627 1.039367
H  -3.773327 -2.380749 1.818196
H  -2.129852 -2.158296 1.241624
H  -3.471065 -2.301904 0.091784
H  -0.844839 -0.89435 -2.394591
H  0.575797 -2.80447 -0.858916
H  4.064954 0.400048 0.481091
H  2.905865 -3.544203 -0.6648
H  5.151357 -3.111467 0.354636
H  5.59679 -1.982275 -0.915556
H  5.63248 -1.468668 0.764621
H  2.717128 3.840194 2.192371
H  1.061961 3.769958 1.548172
H  2.41651 4.125629 0.462764
totalener: -957.05597227 hartree
nucrepener: 1729.44193618 hartree
electener: -2686.49790846 hartree
oneelecener: -4737.10302627 hartree
twoeener: 2050.60511781 hartree
kineticenergy: 952.95701033 hartree
xcener: -92.378384969061 hartree
chargesum: 0.0000000
charge: -0.344197 -0.264769 -0.365362 -0.339482 -0.121005 0.430943 0.017616 0.110782 -0.339506 -0.280257 -0.296290 0.317312 -0.126842 -0.019504 -0.170346 -0.114424 -0.001943 -0.121896 0.362427 -0.215805 -0.132523 0.041306 0.102986 0.096566 0.113359 0.102177 0.080259 0.080119 0.087903 0.092850 0.087669 0.147028 0.131471 0.112927 0.115245 0.089407 0.104280 0.089136 0.116752 0.113239 0.110392
qa: -0.3442 -0.2648 -0.3654 -0.3395 -0.1210 0.4309 0.0176 0.1108 -0.3395 -0.2803 -0.2963 0.3173 -0.1268 -0.0195 -0.1703 -0.1144 -0.0019 -0.1219 0.3624 -0.2158 -0.1325 0.0413 0.1030 0.0966 0.1134 0.1022 0.0803 0.0801 0.0879 0.0928 0.0877 0.1470 0.1315 0.1129 0.1152 0.0894 0.1043 0.0891 0.1168 0.1132 0.1104
va: 2.1763 2.1296 2.1343 3.0148 3.1964 3.5436 3.9020 4.3214 3.9778 3.9449 3.9343 3.8678 3.8250 3.8325 3.9770 3.9980 3.8384 3.9921 4.2148 3.9163 3.8999 1.0285 1.0063 1.0040 1.0125 1.0141 1.0065 1.0043 1.0070 1.0143 1.0056 1.0330 1.0165 1.0301 1.0081 1.0031 0.9922 1.0049 0.9951 0.9944 0.9950
dispcorr: -0.020467439 hartree
energy: -957.076439712301
dipole: -6.70612 8.66565 1.95953 -1.67399 1.23028 -0.44371 8.79934 -8.28778 0.51155
magnitude: 2.07325 au
magnitude: 5.26977 debye
