program: Orca
programVersion: 5.0.2
elementType: O O O N N C C C C C C C C C C C C C C C C H H H H H H H H H H H H H H H H H H H H
charge: 0
multiplicity: 1
keywords: wb97x-d3
keywords: def2-TZVPP
keywords: def2/J RIJCOSX
keywords: DEFGRID2
keywords: scfconv7
keywords: smallprint printgap noloewdin
keywords: NOSOSCF
formula: C16H20N2O3
InChI: InChI=1/C16H20N2O3/c1-9(2)16(4)15(20)17-13(18-16)11-7-6-10(3)8-12(11)14(19)21-5/h6-9,17H,1-5H3
41 atoms
O  -2.63625 2.078541 -1.198577
O  0.972488 1.652312 1.414883
O  2.920681 2.321602 0.548704
N  -1.303002 -0.802416 0.395507
N  -0.670226 0.939952 -0.852419
C  -2.509868 -0.039967 0.099547
C  -3.481914 -0.931395 -0.718234
C  -2.022343 1.150545 -0.739252
C  -3.113113 0.476904 1.403268
C  -3.73469 -2.267588 -0.025894
C  -4.807283 -0.246155 -1.037394
C  -0.326443 -0.203748 -0.147958
C  1.062082 -0.698184 -0.141901
C  2.174771 0.092452 0.163772
C  1.267938 -2.01572 -0.532232
C  3.453603 -0.433519 0.023722
C  3.662666 -1.747462 -0.375105
C  2.546565 -2.533589 -0.640163
C  2.080564 1.477519 0.705498
C  5.049975 -2.306325 -0.482292
C  0.736599 2.94958 1.946397
H  -2.97536 -1.145473 -1.667418
H  -3.957835 1.136027 1.21056
H  -3.445396 -0.349781 2.029071
H  -2.370278 1.03772 1.971289
H  -2.80917 -2.792184 0.200079
H  -4.284256 -2.138604 0.908075
H  -4.343222 -2.906223 -0.667726
H  -4.679733 0.716422 -1.527101
H  -5.401141 -0.089507 -0.13541
H  -5.396557 -0.881656 -1.699848
H  -0.049677 1.520578 -1.392103
H  0.409288 -2.630783 -0.764742
H  4.302466 0.199069 0.251599
H  2.676641 -3.563775 -0.948683
H  5.105193 -3.102218 -1.223988
H  5.77112 -1.539372 -0.761846
H  5.375037 -2.727074 0.471064
H  0.659378 3.698204 1.157322
H  1.525062 3.247067 2.637582
H  -0.209093 2.885372 2.477172
totalener: -957.05461330 hartree
nucrepener: 1730.49874049 hartree
electener: -2687.55335380 hartree
oneelecener: -4738.65692732 hartree
twoeener: 2051.10357352 hartree
kineticenergy: 952.95896148 hartree
xcener: -92.379920262535 hartree
chargesum: -0.0000000
charge: -0.352121 -0.252463 -0.350758 -0.360413 -0.124478 0.418095 0.017976 0.140450 -0.348362 -0.280335 -0.285565 0.230785 0.017442 -0.109103 -0.172137 -0.089962 -0.003785 -0.113775 0.338506 -0.211865 -0.128669 0.042026 0.106375 0.105639 0.093319 0.101397 0.070319 0.084909 0.113455 0.072011 0.083728 0.148570 0.128890 0.122106 0.116005 0.087428 0.092024 0.104817 0.115667 0.121477 0.110375
qa: -0.3521 -0.2525 -0.3508 -0.3604 -0.1245 0.4181 0.0180 0.1404 -0.3484 -0.2803 -0.2856 0.2308 0.0174 -0.1091 -0.1721 -0.0900 -0.0038 -0.1138 0.3385 -0.2119 -0.1287 0.0420 0.1064 0.1056 0.0933 0.1014 0.0703 0.0849 0.1135 0.0720 0.0837 0.1486 0.1289 0.1221 0.1160 0.0874 0.0920 0.1048 0.1157 0.1215 0.1104
va: 2.1686 2.1087 2.1551 2.9925 3.1983 3.5130 3.9362 4.3115 4.0255 3.9358 3.9432 4.0701 3.6080 3.8533 4.0536 3.9837 3.8222 3.9634 4.2192 3.9142 3.8853 1.0093 1.0043 1.0025 1.0094 1.0219 1.0058 1.0040 1.0206 1.0010 1.0063 1.0312 1.0201 1.0281 1.0068 1.0041 1.0040 0.9929 0.9948 0.9963 0.9925
dispcorr: -0.020644236 hartree
energy: -957.075257539308
dipole: -13.39785 14.25577 0.85792 -8.87444 7.98324 -0.89120 2.22098 -2.04682 0.17416
magnitude: 1.24924 au
magnitude: 3.17531 debye
