program: Orca
programVersion: 5.0.2
elementType: O O O N N C C C C C C C C C C C C C C C C H H H H H H H H H H H H H H H H H H H H
charge: 0
multiplicity: 1
keywords: wb97x-d3
keywords: def2-TZVPP
keywords: def2/J RIJCOSX
keywords: DEFGRID2
keywords: scfconv7
keywords: smallprint printgap noloewdin
keywords: NOSOSCF
formula: C16H20N2O3
InChI: InChI=1/C16H20N2O3/c1-9(2)16(4)15(20)17-13(18-16)11-7-6-10(3)8-12(11)14(19)21-5/h6-9,17H,1-5H3
41 atoms
O  -3.687609 -1.66296 0.969806
O  1.59352 1.555586 -1.708189
O  0.995365 2.227584 0.344479
N  -0.999019 0.071829 -0.551898
N  -1.384593 -1.602349 0.879094
C  -2.442787 -0.055739 -0.439544
C  -3.08048 1.23831 0.118024
C  -2.659761 -1.20008 0.553134
C  -3.028527 -0.458902 -1.791974
C  -2.559779 1.585263 1.510636
C  -2.881602 2.42633 -0.815562
C  -0.472467 -0.7995 0.208019
C  0.970999 -0.989839 0.370786
C  1.861164 0.02948 0.023292
C  1.489747 -2.196192 0.826927
C  3.22451 -0.176329 0.139269
C  3.746353 -1.376962 0.614687
C  2.855683 -2.386183 0.952332
C  1.396176 1.3867 -0.408542
C  5.227865 -1.556253 0.753979
C  1.185689 2.799961 -2.25936
H  -4.152575 1.027798 0.196069
H  -4.113738 -0.536504 -1.729429
H  -2.768831 0.271955 -2.55475
H  -2.636875 -1.423368 -2.116717
H  -2.753617 0.797454 2.239684
H  -1.489163 1.791626 1.496063
H  -3.058875 2.48196 1.879824
H  -1.822036 2.657872 -0.923025
H  -3.37234 3.308886 -0.403431
H  -3.300849 2.26027 -1.807528
H  -1.178174 -2.271935 1.600565
H  0.830449 -3.021239 1.065445
H  3.905463 0.621557 -0.134082
H  3.229824 -3.336891 1.310568
H  5.482447 -2.561758 1.084851
H  5.739055 -1.379006 -0.193002
H  5.641615 -0.855122 1.480214
H  0.107416 2.933446 -2.167485
H  1.45671 2.763936 -3.311139
H  1.687276 3.641889 -1.781131
totalener: -957.05526459 hartree
nucrepener: 1754.24393772 hartree
electener: -2711.29920232 hartree
oneelecener: -4786.54034424 hartree
twoeener: 2075.24114192 hartree
kineticenergy: 952.95755929 hartree
xcener: -92.382567184115 hartree
chargesum: 0.0000000
charge: -0.332652 -0.247910 -0.348276 -0.370810 -0.140344 0.348038 0.044488 0.117695 -0.311785 -0.301915 -0.298924 0.343636 -0.060300 -0.038085 -0.149928 -0.091450 -0.033456 -0.120690 0.352419 -0.216647 -0.140063 0.051343 0.106922 0.097742 0.097908 0.092888 0.104463 0.085287 0.087138 0.088599 0.083592 0.144597 0.110796 0.107356 0.111935 0.081012 0.101473 0.104608 0.110927 0.119413 0.108964
qa: -0.3327 -0.2479 -0.3483 -0.3708 -0.1403 0.3480 0.0445 0.1177 -0.3118 -0.3019 -0.2989 0.3436 -0.0603 -0.0381 -0.1499 -0.0915 -0.0335 -0.1207 0.3524 -0.2166 -0.1401 0.0513 0.1069 0.0977 0.0979 0.0929 0.1045 0.0853 0.0871 0.0886 0.0836 0.1446 0.1108 0.1074 0.1119 0.0810 0.1015 0.1046 0.1109 0.1194 0.1090
va: 2.2007 2.1294 2.1521 3.0169 3.2207 3.6528 3.8333 4.3220 3.9769 3.9456 3.9605 3.9339 3.7396 3.8823 3.9966 3.9695 3.8749 3.9996 4.2710 3.9167 3.9084 1.0305 1.0086 1.0047 1.0062 1.0078 1.0123 1.0077 1.0077 1.0107 1.0022 1.0372 1.0213 1.0161 1.0112 1.0086 0.9967 0.9952 0.9842 0.9948 0.9960
dispcorr: -0.021515451 hartree
energy: -957.076780045489
dipole: -2.73077 4.41880 1.68803 8.56658 -9.01321 -0.44664 -4.33091 3.91796 -0.41296
magnitude: 1.79428 au
magnitude: 4.56070 debye
