program: Gaussian 09
title: 000007559
version: EM64L-G09RevD.01
frameworkgroup: C1[X(C9H10O2)]
method: RPBEPBE
basis: SDD
operation: Freq
keyword: #pfreq=noraman
keyword: PBEPBE/SDD
title: #p freq=noraman PBEPBE/SDD
converged: YES YES NO NO
title: Mulliken charges:
elementType: O O C C C C C C C C C H H H H H H H H H H
charge: -0.259631 -0.244048 0.446295 -0.633095 -0.362955 -0.412038 0.277991 -0.219616 -0.219898 -0.241750 -0.505416 0.243851 0.237168 0.258269 0.232945 0.226747 0.226291 0.228721 0.242507 0.244621 0.233041
chargesum: 0.00000
title: Mulliken charges with hydrogens summed into heavy atoms:
elementType: O O C C C C C C C C C
charge: -0.259631 -0.244048 0.446295 -0.152076 -0.104686 -0.179093 0.277991 0.007131 0.006393 -0.013029 0.214753
polarizability: 1.22848664e+02 2.93672748e-01 1.02460086e+02 1.25226612e+01 -2.79654057e+00 6.74028325e+01
1716.lowfreq: -3.6670 -0.0010 -0.0009 -0.0008 5.9149 10.6453 25.0500 28.5944 80.7443
frequency: 24.5926 28.3858 80.7187 94.2734 169.4348 229.4731 254.1205 304.8616 391.3435 404.5532 466.1164 517.0853 607.1299 619.9551 697.2730 709.0706 750.1444 796.3743 831.0464 853.4083 920.2753 933.8605 974.0842 977.2491 989.9865 996.0817 1027.9718 1079.0898 1109.1157 1113.2421 1148.7973 1172.4234 1189.6060 1201.9944 1231.1919 1286.6591 1332.9887 1383.8248 1421.4306 1440.8794 1451.9770 1453.7226 1463.5937 1484.0009 1595.0157 1611.6117 1642.2383 3005.3564 3019.0427 3099.5004 3107.7956 3121.0534 3127.1097 3138.6895 3148.8126 3150.3425 3164.2616
redmass: 3.9439 4.4333 1.5444 2.1071 4.0449 4.8269 3.5730 3.7024 2.5206 2.8096 3.3343 5.3776 4.9812 5.6282 3.6537 1.9790 2.1327 4.2448 3.7067 1.2500 1.5574 2.3145 4.2541 1.4080 5.6934 1.3513 2.2317 1.6864 1.6551 1.3100 1.4359 1.0544 1.1296 2.7069 1.6766 1.5972 1.2850 7.8875 1.1859 2.0680 1.0512 1.1350 1.0516 2.2160 6.1661 6.0849 9.0728 1.0294 1.0615 1.1005 1.1046 1.0853 1.0875 1.0923 1.0966 1.1048 1.1017
irintensity: 1.2926 1.2435 0.3265 0.6630 5.1448 5.9754 9.8719 6.0462 5.0795 0.0167 3.7925 12.6425 8.9496 4.2517 7.8403 56.7271 46.8825 9.3537 5.7130 0.2625 1.7374 4.0791 32.4642 0.4423 2.3174 0.2413 8.0253 22.6874 142.1336 16.9723 5.9674 0.7120 1.3378 1.4621 118.3358 61.3795 11.5555 1.2480 20.5577 8.9327 17.9353 15.2698 12.1785 19.7609 2.9323 15.9061 156.5547 31.5076 12.5825 5.9416 26.5649 3.7602 0.5146 18.7282 32.0824 17.3576 19.6701
temp: 298.150 k
press: 1.00000 atm
elementType: 8 8 6 6 6 6 6 6 6 6 6 1 1 1 1 1 1 1 1 1 1
symmnumber: 1
zpe: 439892.2 jmol-1
zpe.correction: 0.167546 hartree
zpe.thermalcorrener: 0.178134 hartree
zpe.thermalcorrenthalpy: 0.179078 hartree
zpe.thermalcorrgfe: 0.129067 hartree
zpe.sumelectzpe: -498.595507 hartree
zpe.sumelectthermal: -498.584920 hartree
zpe.sumelectthermalent: -498.583975 hartree
zpe.sumelectthermalfe: -498.633986 hartree
dipole: 0.2327 -1.5897 -0.2748
dipole: 1.6299
quadrupole: -55.2860 -64.8451 -62.7286
quadrupole: -3.8333 -0.0372 -0.1782
quadrupole: 5.6672 -3.8919 -1.7754 -3.8333 -0.0372 -0.1782
hfenergy: -498.763053 hartree
pointgroup: C01 [X(C9H10O2)]
dipole: 0.1403246 -0.6249898 -0.0303494 debye
dipolederiv: -1.0398621 0.3135599 0.2880658 0.4929041 -0.7264593 -0.1582806 0.4436641 -0.1087659 -0.4645255 -0.6138551 -0.1320074 0.11664 0.0984697 -0.8868421 -0.0321376 0.1689607 0.1944806 -0.3867568 0.3871494 0.053887 0.111086 0.0188407 -0.0195654 0.0344421 0.3143438 0.0543022 -0.0272387 -0.3785168 -0.0878565 0.1100462 -0.1203157 0.0525021 -0.0133239 0.0578688 0.0176564 0.0319295 -0.1508937 0.0706409 0.0133806 0.095697 0.0160054 0.006719 -0.0272615 -0.0230717 -0.1434851 -0.1735598 -0.0646871 0.053198 -0.0478828 0.0296996 -0.074496 0.0122097 -0.0653886 -0.1129071 1.2519696 -0.1542185 -0.4415533 -0.5077068 1.2971778 0.1558957 -0.6891049 -0.1309129 0.4178607 -0.0355445 -0.0517643 0.0717774 -0.0643235 0.0789786 -0.0733411 0.068973 -0.0789855 -0.0882148 -0.0291915 0.0811384 0.0503763 0.0702217 0.0872452 -0.0009128 0.0394328 -0.0041844 -0.1136072 0.0149508 0.0184016 0.1146618 0.0245946 -0.0769496 -0.0043804 0.1022723 -0.0082863 -0.1027269 0.5337544 -0.0672471 -0.106237 0.0091843 0.2266329 0.0191778 -0.1795462 0.0679932 0.36072 0.0353776 0.0026054 -0.0050706 -0.0224456 0.0037174 -0.1126387 -0.0160447 -0.055649 -0.0043701 0.0557334 0.0062719 -0.0175357 0.0521635 -0.0416448 0.1018646 -0.0086252 0.0473148 0.061464 0.0932354 -0.0880018 -0.0338216 -0.0780809 -0.0138363 -0.0047991 -0.0214778 -0.0023831 0.1252738 0.06097 0.0820408 -0.0762258 0.0654489 -0.0269013 0.068525 -0.0614362 0.0801054 0.0914827 0.0505698 0.0620494 -0.0654194 0.075157 -0.0512003 0.0811886 -0.0776963 0.0781556 0.1005755 0.0440036 -0.0911565 -0.0380943 -0.1049039 -0.0825592 -0.0046587 -0.0458523 -0.0021851 0.1365005 -0.0720196 -0.0218951 -0.1227147 -0.0211739 0.089604 0.0031185 -0.1247798 0.0034155 0.0909062 -0.0433476 -0.0439497 0.0054834 -0.1495105 0.0138059 -0.0427378 -0.0136003 -0.0784251 0.0205795 -0.0143775 0.0389343 -0.0691533 -0.0092056 0.089026 0.081306 0.0162396 0.0191122 -0.0908471 0.0234543 0.0732545 0.0411104 0.1228676 -0.0584367 -0.0305306 0.0414603 -0.0042982 0.097387 unknown
polarizability: 121.6047243|3.531481|101.7284962|14.5389341|-5.7007108|69.3783622 unknown
InChI: InChI=1S/C9H10O2/c1-11-9(10)7-8-5-3-2-4-6-8/h2-6H,7H2,1H3
charge 0 multiplicity 1
21 atoms
O  2.711377 -0.531182 0.14197
O  2.101495 1.715499 0.049278
C  -0.550574 0.011447 0.665422
C  0.778728 0.128327 1.416003
C  -1.148748 1.156853 0.079403
C  -1.200583 -1.241447 0.54722
C  1.906638 0.557811 0.484696
C  -2.378359 1.048403 -0.606549
C  -2.432938 -1.350147 -0.138242
C  -3.026106 -0.204893 -0.716253
C  3.808582 -0.240679 -0.814979
H  0.699246 0.898852 2.204382
H  1.042742 -0.832554 1.884497
H  -0.64155 2.125861 0.152373
H  -0.742165 -2.133482 0.990816
H  -2.831215 1.940057 -1.054707
H  -2.926383 -2.325241 -0.219862
H  -3.981295 -0.287297 -1.246885
H  4.477841 0.534792 -0.406219
H  3.391319 0.109911 -1.773826
H  4.33465 -1.19759 -0.93694
