program: Orca
programVersion: 5.0.2
elementType: S F F O O N N N N N C C C C C C C C C C C C H H H H H H H H H
charge: 0
multiplicity: 1
keywords: wb97x-d3
keywords: def2-TZVPP
keywords: def2/J RIJCOSX
keywords: DEFGRID2
keywords: scfconv7
keywords: smallprint printgap noloewdin
keywords: NOSOSCF
formula: C12H9F2N5O2S
InChI: InChI=1/C12H9F2N5O2S/c1-7-5-6-19-11(15-7)16-12(17-19)22(20,21)18-10-8(13)3-2-4-9(10)14/h2-6,18H,1H3
31 atoms
S  -0.845271 -1.980057 -0.244849
F  -0.366995 1.03189 1.655379
F  -4.092981 -0.685634 -0.569759
O  -0.554523 -3.278501 0.321575
O  -1.468967 -1.840076 -1.542813
N  1.955734 0.422638 -0.792457
N  -1.801766 -1.186807 0.850241
N  0.764589 -0.055658 -1.139767
N  1.648394 -1.274825 0.561038
N  3.679501 -0.038305 0.761459
C  0.660405 -1.048158 -0.291732
C  2.487474 -0.310906 0.231931
C  -2.20157 0.128743 0.53286
C  2.607923 1.484594 -1.323691
C  4.335632 0.985197 0.268204
C  3.815983 1.781158 -0.791974
C  -1.470586 1.242694 0.932136
C  -3.355346 0.360591 -0.205903
C  -1.842153 2.529402 0.610627
C  -3.757355 1.631898 -0.560256
C  5.664002 1.331573 0.841775
C  -2.990175 2.710954 -0.147163
H  -1.534442 -1.358345 1.817035
H  2.125548 2.021462 -2.126811
H  4.380623 2.619144 -1.172688
H  -1.244399 3.368689 0.938853
H  -4.657508 1.77475 -1.142284
H  5.984099 0.598731 1.577673
H  5.621005 2.311745 1.320356
H  6.415578 1.39728 0.054367
H  -3.293812 3.712443 -0.418214
elementType: S F O N C H
totalener: -1484.89142252 hartree
nucrepener: 2055.96767918 hartree
electener: -3540.85910170 hartree
oneelecener: -6123.51240141 hartree
twoeener: 2582.65329971 hartree
cpcmener: -0.05555405 hartree
kineticenergy: 1479.93258837 hartree
xcener: -117.708650119475 hartree
chargesum: -0.0000000
charge: 0.878145 -0.206451 -0.200997 -0.508782 -0.502076 0.157068 -0.202419 -0.310632 -0.324477 -0.341943 0.038759 0.295428 0.059637 0.043313 0.200204 -0.163861 0.212941 0.210240 -0.158984 -0.164695 -0.235153 -0.126509 0.197533 0.183955 0.164866 0.157402 0.155253 0.096053 0.114865 0.112314 0.169000
qa: 0.8781 -0.2065 -0.2010 -0.5088 -0.5021 0.1571 -0.2024 -0.3106 -0.3245 -0.3419 0.0388 0.2954 0.0596 0.0433 0.2002 -0.1639 0.2129 0.2102 -0.1590 -0.1647 -0.2352 -0.1265 0.1975 0.1840 0.1649 0.1574 0.1553 0.0961 0.1149 0.1123 0.1690
va: 5.8260 1.0865 1.0952 2.0009 1.9855 3.4287 3.0273 2.8460 3.0447 3.0405 4.2063 4.2639 3.5864 3.9631 3.8546 3.9049 3.9937 4.1133 3.9060 3.8738 3.9271 3.8564 1.0127 0.9941 0.9899 0.9960 0.9967 1.0186 0.9961 0.9966 0.9841
dispcorr: -0.015578045 hartree
energy: -1484.907000567523
dipole: 17.00953 -14.89263 2.11690 15.03791 -9.50103 5.53688 -0.19165 0.13872 -0.05293
magnitude: 5.92799 au
magnitude: 15.06777 debye
